constituent
type: ObjectProperty
comment: ManufacturedItemDefinition.component.component.constituent: A reference to a constituent of the manufactured item as a whole, linked here so that its component location within the item can be indicated. This not where the item's ingredient are primarily stated (for which see Ingredient.for or ManufacturedItemDefinition.ingredient).
comment: ManufacturedItemDefinition.component.constituent: A reference to a constituent of the manufactured item as a whole, linked here so that its component location within the item can be indicated. This not where the item's ingredient are primarily stated (for which see Ingredient.for or ManufacturedItemDefinition.ingredient).
modifierExtensionProperty: constituent
title: ManufacturedItemDefinition.component.component.constituent: A reference to a constituent of the manufactured item as a whole, linked here so that its component location within the item can be indicated. This not where the item's ingredient are primarily stated (for which see Ingredient.for or ManufacturedItemDefinition.ingredient)
title: ManufacturedItemDefinition.component.constituent: A reference to a constituent of the manufactured item as a whole, linked here so that its component location within the item can be indicated. This not where the item's ingredient are primarily stated (for which see Ingredient.for or ManufacturedItemDefinition.ingredient)

_careTeam
type: ObjectProperty
comment: (Modified) ExplanationOfBenefit.careTeam
comment: (Modified) EpisodeOfCare.careTeam
comment: (Modified) Encounter.careTeam
comment: (Modified) Claim.careTeam
comment: (Modified) CarePlan.careTeam

ClinicalUseDefinitionWarningComponent
type: Class
comment: ClinicalUseDefinitionWarningComponent: A critical piece of information about environmental, health or physical risks or hazards that serve as caution to the user. For example 'Do not operate heavy machinery', 'May cause drowsiness', or 'Get medical advice/attention if you feel unwell'.
subclass of: BackboneElement
subclass of: Restriction
  max cardinality: 1
  on property: code
subclass of: Restriction
  all values from: CodeableConcept
  on property: code
subclass of: Restriction
  max cardinality: 1
  on property: description
subclass of: Restriction
  all values from: markdown
  on property: description

PlanDefinitionActionParticipantComponent
type: Class
comment: PlanDefinitionActionComponentAction.PlanDefinitionActionParticipantComponent: Indicates who should participate in performing the action described.
comment: PlanDefinitionActionComponent.PlanDefinitionActionParticipantComponent: Indicates who should participate in performing the action described.
subclass of: BackboneElement
subclass of: Restriction
  max cardinality: 1
  on property: type
subclass of: Restriction
  all values from: string
  on property: actorId
subclass of: Restriction
  max cardinality: 1
  on property: typeCanonical
subclass of: Restriction
  max cardinality: 1
  on property: actorId
subclass of: Restriction
  max cardinality: 1
  on property: role
subclass of: Restriction
  all values from: CodeableConcept
  on property: role
subclass of: Restriction
  all values from: string
  on property: actorId
subclass of: Restriction
  all values from: CodeableConcept
  on property: role
subclass of: Restriction
  all values from: canonical
  on property: typeCanonical
subclass of: Restriction
  max cardinality: 1
  on property: actorId
subclass of: Restriction
  max cardinality: 1
  on property: function
subclass of: Restriction
  all values from: CodeableConcept
  on property: function
subclass of: Restriction
  all values from: Reference
  on property: typeReference
subclass of: Restriction
  max cardinality: 1
  on property: function
subclass of: Restriction
  all values from: code
  on property: type
subclass of: Restriction
  max cardinality: 1
  on property: type
subclass of: Restriction
  max cardinality: 1
  on property: typeReference
subclass of: Restriction
  all values from: CodeableConcept
  on property: function
subclass of: Restriction
  max cardinality: 1
  on property: role
subclass of: Restriction
  all values from: Reference
  on property: typeReference
subclass of: Restriction
  max cardinality: 1
  on property: typeReference
subclass of: Restriction
  max cardinality: 1
  on property: typeCanonical
subclass of: Restriction
  all values from: canonical
  on property: typeCanonical
subclass of: Restriction
  all values from: code
  on property: type

VisionPrescriptionLensSpecificationComponent
type: Class
comment: VisionPrescriptionLensSpecificationComponent: Contain the details of the individual lens specifications and serves as the authorization for the fullfillment by certified professionals.
subclass of: BackboneElement
subclass of: Restriction
  max cardinality: 1
  on property: diameter
subclass of: Restriction
  all values from: string
  on property: brand
subclass of: Restriction
  all values from: code
  on property: eye
subclass of: Restriction
  all values from: decimal
  on property: backCurve
subclass of: Restriction
  all values from: SimpleQuantity
  on property: duration
subclass of: Restriction
  cardinality: 1
  on property: eye
subclass of: Restriction
  all values from: Prism
  on property: prism
subclass of: Restriction
  max cardinality: 1
  on property: axis
subclass of: Restriction
  max cardinality: 1
  on property: power
subclass of: Restriction
  max cardinality: 1
  on property: sphere
subclass of: Restriction
  max cardinality: 1
  on property: add
subclass of: Restriction
  all values from: CodeableConcept
  on property: product
subclass of: Restriction
  all values from: Annotation
  on property: note
subclass of: Restriction
  max cardinality: 1
  on property: brand
subclass of: Restriction
  max cardinality: 1
  on property: color
subclass of: Restriction
  all values from: string
  on property: color
subclass of: Restriction
  max cardinality: 1
  on property: cylinder
subclass of: Restriction
  all values from: decimal
  on property: cylinder
subclass of: Restriction
  all values from: decimal
  on property: add
subclass of: Restriction
  cardinality: 1
  on property: product
subclass of: Restriction
  all values from: decimal
  on property: diameter
subclass of: Restriction
  all values from: integer
  on property: axis
subclass of: Restriction
  all values from: decimal
  on property: power
subclass of: Restriction
  all values from: decimal
  on property: sphere
subclass of: Restriction
  max cardinality: 1
  on property: duration
subclass of: Restriction
  max cardinality: 1
  on property: backCurve

_answerOption
type: ObjectProperty
comment: (Modified) Questionnaire.item.item.answerOption
comment: (Modified) Questionnaire.item.answerOption

decimal
type: Class
comment: A rational number with implicit precision
subclass of: Primitive
subclass of: Restriction
  cardinality: 1
  on property: http://hl7.org/fhir/v
subclass of: Restriction
  all values from: Datatype
    union of: decimal
    union of: double
  on property: http://hl7.org/fhir/v

_applies
type: ObjectProperty
comment: (Modified) Contract.term.group.applies
comment: (Modified) Contract.term.applies
comment: (Modified) Contract.applies

serviceProvider
type: ObjectProperty
comment: Encounter.serviceProvider: The organization that is primarily responsible for this Encounter's services. This MAY be the same as the organization on the Patient record, however it could be different, such as if the actor performing the services was from an external organization (which may be billed seperately) for an external consultation. Refer to the colonoscopy example on the Encounter examples tab.
modifierExtensionProperty: serviceProvider
title: Encounter.serviceProvider: The organization (facility) responsible for this encounter

NutritionProductIngredientComponent
type: Class
comment: NutritionProductIngredientComponent: Ingredients contained in this product.
subclass of: BackboneElement
subclass of: Restriction
  all values from: Ratio
  on property: amount
subclass of: Restriction
  cardinality: 1
  on property: item
subclass of: Restriction
  all values from: CodeableReference
  on property: item

Error
type: Class
comment: ClaimResponse.Error: Errors encountered during the processing of the adjudication.
subclass of: BackboneElement
subclass of: Restriction
  all values from: positiveInt
  on property: itemSequence
subclass of: Restriction
  all values from: CodeableConcept
  on property: code
subclass of: Restriction
  all values from: positiveInt
  on property: subDetailSequence
subclass of: Restriction
  all values from: positiveInt
  on property: detailSequence
subclass of: Restriction
  max cardinality: 1
  on property: itemSequence
subclass of: Restriction
  cardinality: 1
  on property: code
subclass of: Restriction
  max cardinality: 1
  on property: subDetailSequence
subclass of: Restriction
  max cardinality: 1
  on property: detailSequence
subclass of: Restriction
  all values from: string
  on property: expression

productStatus
type: ObjectProperty
comment: BiologicallyDerivedProduct.productStatus: Whether the product is currently available.
modifierExtensionProperty: _productStatus
title: BiologicallyDerivedProduct.productStatus: available | unavailable

ImagingStudySeriesPerformerComponent
type: Class
comment: ImagingStudySeriesComponent.ImagingStudySeriesPerformerComponent: Indicates who or what performed the series and how they were involved.
subclass of: BackboneElement
subclass of: Restriction
  cardinality: 1
  on property: actor
subclass of: Restriction
  all values from: Reference
  on property: actor
subclass of: Restriction
  max cardinality: 1
  on property: function
subclass of: Restriction
  all values from: CodeableConcept
  on property: function

_lowerLimit
type: ObjectProperty
comment: (Modified) SampledData.lowerLimit

Medication
type: Class
comment: This resource is primarily used for the identification and definition of a medication, including ingredients, for the purposes of prescribing, dispensing, and administering a medication as well as for making statements about medication use.
subclass of: DomainResource
subclass of: clinical.medication
subclass of: Restriction
  max cardinality: 1
  on property: definition
subclass of: Restriction
  max cardinality: 1
  on property: code
subclass of: Restriction
  all values from: Quantity
  on property: totalVolume
subclass of: Restriction
  all values from: CodeableConcept
  on property: code
subclass of: Restriction
  max cardinality: 1
  on property: status
subclass of: Restriction
  all values from: CodeableConcept
  on property: doseForm
subclass of: Restriction
  max cardinality: 1
  on property: marketingAuthorizationHolder
subclass of: Restriction
  max cardinality: 1
  on property: batch
subclass of: Restriction
  all values from: code
  on property: status
subclass of: Restriction
  all values from: Identifier
  on property: identifier
subclass of: Restriction
  all values from: MedicationIngredientComponent
  on property: ingredient
subclass of: Restriction
  all values from: Reference
  on property: definition
subclass of: Restriction
  max cardinality: 1
  on property: doseForm
subclass of: Restriction
  all values from: MedicationBatchComponent
  on property: batch
subclass of: Restriction
  max cardinality: 1
  on property: totalVolume
subclass of: Restriction
  all values from: Reference
  on property: marketingAuthorizationHolder
modifierExtensionClass: Medication

header
type: ObjectProperty
comment: Endpoint.header: Additional headers / information to send as part of the notification.
modifierExtensionProperty: header
title: Endpoint.header: Usage depends on the channel type

StructureMapGroupRuleComponent
type: Class
comment: StructureMapGroupComponent.StructureMapGroupRuleComponent: Transform Rule from source to target.
subclass of: BackboneElement
subclass of: Restriction
  max cardinality: 1
  on property: name
subclass of: Restriction
  all values from: StructureMapGroupComponent.StructureMapGroupRuleComponentRule
  on property: rule
subclass of: Restriction
  all values from: StructureMapGroupRuleTargetComponent
  on property: target
subclass of: Restriction
  min cardinality: 1
  on property: source
subclass of: Restriction
  max cardinality: 1
  on property: documentation
subclass of: Restriction
  all values from: string
  on property: documentation
subclass of: Restriction
  all values from: StructureMapGroupRuleDependentComponent
  on property: dependent
subclass of: Restriction
  all values from: id
  on property: name
subclass of: Restriction
  all values from: StructureMapGroupRuleSourceComponent
  on property: source

_productType
type: ObjectProperty
comment: (Modified) MedicationKnowledge.productType

_relatedItem
type: ObjectProperty
comment: (Modified) InventoryItem.association.relatedItem

author
type: ObjectProperty
comment: Basic.author: Indicates who was responsible for creating the resource instance.
comment: DetectedIssue.mitigation.author: Identifies the practitioner who determined the mitigation and takes responsibility for the mitigation step occurring.
comment: Library.author: An individiual or organization primarily involved in the creation and maintenance of the content.
comment: ArtifactAssessment.content.author: Indicates who or what authored the content.
comment: Composition.section.section.author: Identifies who is responsible for the information in this section, not necessarily who typed it in.
comment: MedicationKnowledge.author: The creator or owner of the knowledge or information about the medication.
comment: Evidence.author: An individiual, organization, or device primarily involved in the creation and maintenance of the content.
comment: EvidenceReport.author: An individiual, organization, or device primarily involved in the creation and maintenance of the content.
comment: RequestOrchestration.author: Provides a reference to the author of the request orchestration.
comment: ValueSet.author: An individiual or organization primarily involved in the creation and maintenance of the ValueSet.
comment: DetectedIssue.author: Individual or device responsible for the issue being raised. For example, a decision support application or a pharmacist conducting a medication review.
comment: Flag.author: The person, organization or device that created the flag.
comment: CodeSystem.author: An individiual or organization primarily involved in the creation and maintenance of the CodeSystem.
comment: MessageHeader.author: The logical author of the message - the personor device that decided the described event should happen. When there is more than one candidate, pick the most proximal to the MessageHeader. Can provide other authors in extensions.
comment: AdverseEvent.suspectEntity.causality.author: The author of the information on the possible cause of the event.
comment: EvidenceReport.section.author: Identifies who is responsible for the information in this section, not necessarily who typed it in.
comment: NamingSystem.author: An individiual or organization primarily involved in the creation and maintenance of the NamingSystem.
comment: Composition.author: Identifies who is responsible for the information in the composition, not necessarily who typed it in.
comment: Composition.section.author: Identifies who is responsible for the information in this section, not necessarily who typed it in.
comment: PlanDefinition.author: An individiual or organization primarily involved in the creation and maintenance of the content.
comment: MetadataResource.author: An individiual or organization primarily involved in the creation and maintenance of the {{title}}.
comment: DocumentReference.author: Identifies who is responsible for adding the information to the document.
comment: Contract.author: The individual or organization that authored the Contract definition, derivative, or instance in any legal state.
comment: ArtifactAssessment.content.component.author: Indicates who or what authored the content.
comment: EvidenceReport.section.section.author: Identifies who is responsible for the information in this section, not necessarily who typed it in.
comment: EventDefinition.author: An individiual or organization primarily involved in the creation and maintenance of the content.
comment: EvidenceVariable.author: An individiual or organization primarily involved in the creation and maintenance of the content.
comment: QuestionnaireResponse.author: The individual or device that received the answers to the questions in the QuestionnaireResponse and recorded them in the system.
comment: SubstanceSourceMaterial.organism.author: 4.9.13.6.1 Author type (Conditional).
comment: Linkage.author: Identifies the user or organization responsible for asserting the linkages as well as the user or organization who establishes the context in which the nature of each linkage is evaluated.
comment: Measure.author: An individiual or organization primarily involved in the creation and maintenance of the content.
comment: Citation.author: Who authored or created the citation record.
comment: ActivityDefinition.author: An individiual or organization primarily involved in the creation and maintenance of the content.
comment: Annotation.author
comment: ConceptMap.author: An individiual or organization primarily involved in the creation and maintenance of the ConceptMap.
sub property of: who.author
sub property of: who.actor
modifierExtensionProperty: author
title: Library.author: Who authored the content
title: Composition.author: Who and/or what authored the composition
title: Basic.author: Who created
title: Evidence.author: Who authored the content
title: Citation.author: Who authored the citation record
title: MedicationKnowledge.author: Creator or owner of the knowledge or information about the medication
title: MessageHeader.author: The source of the decision
title: ActivityDefinition.author: Who authored the content
title: ConceptMap.author: Who authored the ConceptMap
title: RequestOrchestration.author: Device or practitioner that authored the request orchestration
title: DocumentReference.author: Who and/or what authored the document
title: SubstanceSourceMaterial.organism.author: 4.9.13.6.1 Author type (Conditional)
title: Contract.author: Source of Contract
title: EvidenceVariable.author: Who authored the content
title: Measure.author: Who authored the content
title: Composition.section.section.author: Who and/or what authored the section
title: Flag.author: Flag creator
title: QuestionnaireResponse.author: The individual or device that received and recorded the answers
title: AdverseEvent.suspectEntity.causality.author: Author of the information on the possible cause of the event
title: NamingSystem.author: Who authored the CodeSystem
title: ArtifactAssessment.content.component.author: Who authored the content
title: ValueSet.author: Who authored the ValueSet
title: Linkage.author: Who is responsible for linkages
title: PlanDefinition.author: Who authored the content
title: ArtifactAssessment.content.author: Who authored the content
title: EvidenceReport.author: Who authored the content
title: DetectedIssue.author: The provider or device that identified the issue
title: MetadataResource.author: Who authored the {{title}}
title: EvidenceReport.section.author: Who and/or what authored the section
title: DetectedIssue.mitigation.author: Who is committing?
title: EvidenceReport.section.section.author: Who and/or what authored the section
title: EventDefinition.author: Who authored the content
title: Composition.section.author: Who and/or what authored the section
title: CodeSystem.author: Who authored the CodeSystem

_direction
type: ObjectProperty
comment: (Modified) TestScript.test.action.assert.direction
comment: (Modified) TestScript.setup.action.assert.direction
comment: (Modified) DataRequirement.sort.direction

_frequencyOfOccurrence
type: ObjectProperty
comment: (Modified) ClinicalUseDefinition.undesirableEffect.frequencyOfOccurrence

RequestOrchestration
type: Class
comment: A set of related requests that can be used to capture intended activities that have inter-dependencies such as "give this medication after that one".
subclass of: clinical.general
subclass of: DomainResource
subclass of: Restriction
  max cardinality: 1
  on property: priority
subclass of: Restriction
  max cardinality: 1
  on property: authoredOn
subclass of: Restriction
  all values from: Reference
  on property: replaces
subclass of: Restriction
  all values from: Annotation
  on property: note
subclass of: Restriction
  all values from: CodeableConcept
  on property: code
subclass of: Restriction
  max cardinality: 1
  on property: groupIdentifier
subclass of: Restriction
  all values from: Reference
  on property: author
subclass of: Restriction
  all values from: CodeableReference
  on property: reason
subclass of: Restriction
  max cardinality: 1
  on property: author
subclass of: Restriction
  all values from: Reference
  on property: basedOn
subclass of: Restriction
  all values from: dateTime
  on property: authoredOn
subclass of: Restriction
  cardinality: 1
  on property: status
subclass of: Restriction
  all values from: code
  on property: intent
subclass of: Restriction
  all values from: Reference
  on property: goal
subclass of: Restriction
  all values from: code
  on property: priority
subclass of: Restriction
  max cardinality: 1
  on property: encounter
subclass of: Restriction
  all values from: RequestOrchestrationActionComponent
  on property: action
subclass of: Restriction
  all values from: code
  on property: status
subclass of: Restriction
  cardinality: 1
  on property: intent
subclass of: Restriction
  all values from: Identifier
  on property: identifier
subclass of: Restriction
  all values from: Reference
  on property: encounter
subclass of: Restriction
  all values from: Reference
  on property: subject
subclass of: Restriction
  max cardinality: 1
  on property: code
subclass of: Restriction
  all values from: canonical
  on property: instantiatesCanonical
subclass of: Restriction
  all values from: uri
  on property: instantiatesUri
subclass of: Restriction
  all values from: Identifier
  on property: groupIdentifier
subclass of: Restriction
  max cardinality: 1
  on property: subject
modifierExtensionClass: _RequestOrchestration

Detail
type: Class
comment: Claim.Item.Detail: A claim detail line. Either a simple (a product or service) or a 'group' of sub-details which are simple items.
comment: ExplanationOfBenefit.Item.Detail: Second-tier of goods and services.
subclass of: BackboneElement
subclass of: Restriction
  max cardinality: 1
  on property: productOrService
subclass of: Restriction
  max cardinality: 1
  on property: quantity
subclass of: Restriction
  all values from: Money
  on property: patientPaid
subclass of: Restriction
  all values from: CodeableConcept
  on property: programCode
subclass of: Restriction
  max cardinality: 1
  on property: reviewOutcome
subclass of: Restriction
  max cardinality: 1
  on property: category
subclass of: Restriction
  all values from: decimal
  on property: factor
subclass of: Restriction
  max cardinality: 1
  on property: revenue
subclass of: Restriction
  all values from: CodeableConcept
  on property: modifier
subclass of: Restriction
  all values from: Money
  on property: patientPaid
subclass of: Restriction
  max cardinality: 1
  on property: patientPaid
subclass of: Restriction
  all values from: Reference
  on property: udi
subclass of: Restriction
  all values from: CodeableConcept
  on property: productOrService
subclass of: Restriction
  all values from: Money
  on property: unitPrice
subclass of: Restriction
  all values from: CodeableConcept
  on property: category
subclass of: Restriction
  all values from: Money
  on property: tax
subclass of: Restriction
  all values from: CodeableConcept
  on property: productOrServiceEnd
subclass of: Restriction
  all values from: SubDetail
  on property: subDetail
subclass of: Restriction
  max cardinality: 1
  on property: unitPrice
subclass of: Restriction
  cardinality: 1
  on property: sequence
subclass of: Restriction
  max cardinality: 1
  on property: category
subclass of: Restriction
  all values from: Money
  on property: net
subclass of: Restriction
  max cardinality: 1
  on property: revenue
subclass of: Restriction
  max cardinality: 1
  on property: patientPaid
subclass of: Restriction
  all values from: CodeableConcept
  on property: revenue
subclass of: Restriction
  all values from: CodeableConcept
  on property: programCode
subclass of: Restriction
  max cardinality: 1
  on property: net
subclass of: Restriction
  all values from: SimpleQuantity
  on property: quantity
subclass of: Restriction
  all values from: Identifier
  on property: traceNumber
subclass of: Restriction
  max cardinality: 1
  on property: factor
subclass of: Restriction
  all values from: ExplanationOfBenefit.Item.DetailAdjudication
  on property: adjudication
subclass of: Restriction
  max cardinality: 1
  on property: productOrService
subclass of: Restriction
  all values from: CodeableConcept
  on property: category
subclass of: Restriction
  all values from: Money
  on property: net
subclass of: Restriction
  max cardinality: 1
  on property: productOrServiceEnd
subclass of: Restriction
  max cardinality: 1
  on property: tax
subclass of: Restriction
  all values from: decimal
  on property: factor
subclass of: Restriction
  all values from: CodeableConcept
  on property: productOrService
subclass of: Restriction
  all values from: CodeableConcept
  on property: productOrServiceEnd
subclass of: Restriction
  all values from: Reference
  on property: udi
subclass of: Restriction
  all values from: positiveInt
  on property: sequence
subclass of: Restriction
  all values from: SubDetail
  on property: subDetail
subclass of: Restriction
  all values from: CodeableConcept
  on property: modifier
subclass of: Restriction
  all values from: SimpleQuantity
  on property: quantity
subclass of: Restriction
  all values from: Money
  on property: tax
subclass of: Restriction
  max cardinality: 1
  on property: unitPrice
subclass of: Restriction
  max cardinality: 1
  on property: factor
subclass of: Restriction
  max cardinality: 1
  on property: productOrServiceEnd
subclass of: Restriction
  all values from: positiveInt
  on property: sequence
subclass of: Restriction
  all values from: Money
  on property: unitPrice
subclass of: Restriction
  max cardinality: 1
  on property: quantity
subclass of: Restriction
  all values from: CodeableConcept
  on property: revenue
subclass of: Restriction
  all values from: ExplanationOfBenefit.Item.DetailReviewOutcome
  on property: reviewOutcome
subclass of: Restriction
  cardinality: 1
  on property: sequence
subclass of: Restriction
  all values from: positiveInt
  on property: noteNumber
subclass of: Restriction
  max cardinality: 1
  on property: net
subclass of: Restriction
  all values from: Identifier
  on property: traceNumber
subclass of: Restriction
  max cardinality: 1
  on property: tax

numberOfRepeatsAllowed
type: ObjectProperty
comment: MedicationRequest.dispenseRequest.numberOfRepeatsAllowed: An integer indicating the number of times, in addition to the original dispense, (aka refills or repeats) that the patient can receive the prescribed medication. Usage Notes: This integer does not include the original order dispense. This means that if an order indicates dispense 30 tablets plus "3 repeats", then the order can be dispensed a total of 4 times and the patient can receive a total of 120 tablets. A prescriber may explicitly say that zero refills are permitted after the initial dispense.
modifierExtensionProperty: numberOfRepeatsAllowed
title: MedicationRequest.dispenseRequest.numberOfRepeatsAllowed: Number of refills authorized

_communicationRequest
type: ObjectProperty
comment: (Modified) ClaimResponse.communicationRequest

DocumentReferenceContentProfileComponent
type: Class
comment: DocumentReferenceContentComponent.DocumentReferenceContentProfileComponent: An identifier of the document constraints, encoding, structure, and template that the document conforms to beyond the base format indicated in the mimeType.
subclass of: BackboneElement
subclass of:
  union of: Restriction
    all values from: Coding
    on property: value
  union of: Restriction
    cardinality: 1
    on property: value
  union of: Restriction
    all values from: uri
    on property: value
  union of: Restriction
    cardinality: 1
    on property: value
  union of: Restriction
    all values from: canonical
    on property: value
  union of: Restriction
    cardinality: 1
    on property: value

_masterFile
type: ObjectProperty
comment: (Modified) MedicinalProductDefinition.masterFile

comment
type: ObjectProperty
comment: Schedule.comment: Comments on the availability to describe any extended information. Such as custom constraints on the slots that may be associated.
comment: SubstanceReferenceInformation.comment: Todo.
comment: ElementDefinition.comment: Explanatory notes and implementation guidance about the data element, including notes about how to use the data properly, exceptions to proper use, etc. (Note: The text you are reading is specified in ElementDefinition.comment).
comment: Ingredient.comment: A place for providing any notes that are relevant to the component, e.g. removed during process, adjusted for loss on drying.
comment: InsurancePlan.plan.generalCost.comment: Additional information about the general costs associated with this plan.
comment: StructureDefinition.mapping.comment: Comments about this mapping, including version notes, issues, scope limitations, and other important notes for usage.
comment: ElementDefinition.mapping.comment: Comments that provide information about the mapping or its use.
comment: DiagnosticReport.media.comment: A comment about the image or data. Typically, this is used to provide an explanation for why the image or data is included, or to draw the viewer's attention to important features.
comment: ConceptMap.group.element.target.comment: A description of status/issues in mapping that conveys additional information not represented in the structured data.
comment: HealthcareService.eligibility.comment: Describes the eligibility conditions for the service.
comment: OperationDefinition.overload.comment: Comments to go on overload.
comment: NamingSystem.uniqueId.comment: Notes about the past or intended usage of this identifier.
comment: HealthcareService.comment: Any additional description of the service and/or any specific issues not covered by the other attributes, which can be displayed as further detail under the serviceName.
comment: OperationDefinition.comment: Additional information about how to use this operation or named query.
comment: AppointmentResponse.comment: Additional comments about the appointment.
comment: Slot.comment: Comments on the slot to describe any extended information. Such as custom constraints on the slot.
modifierExtensionProperty: comment
title: Ingredient.comment: A place for providing any notes that are relevant to the component, e.g. removed during process, adjusted for loss on drying
title: HealthcareService.comment: Additional description and/or any specific issues not covered elsewhere
title: Slot.comment: Comments on the slot to describe any extended information. Such as custom constraints on the slot
title: ConceptMap.group.element.target.comment: Description of status/issues in mapping
title: ElementDefinition.comment: Comments about the use of this element
title: OperationDefinition.overload.comment: Comments to go on overload
title: StructureDefinition.mapping.comment: Versions, Issues, Scope limitations etc
title: SubstanceReferenceInformation.comment: Todo
title: OperationDefinition.comment: Additional information about use
title: InsurancePlan.plan.generalCost.comment: Additional cost information
title: NamingSystem.uniqueId.comment: Notes about identifier usage
title: DiagnosticReport.media.comment: Comment about the image or data (e.g. explanation)
title: ElementDefinition.mapping.comment: Comments about the mapping or its use
title: HealthcareService.eligibility.comment: Describes the eligibility conditions for the service
title: Schedule.comment: Comments on availability
title: AppointmentResponse.comment: Additional comments

availableTime
type: ObjectProperty
comment: Availability.availableTime: Times the {item} is available.
modifierExtensionProperty: _availableTime
title: Availability.availableTime: Times the {item} is available

_assert
type: ObjectProperty
comment: (Modified) TestScript.test.action.assert
comment: (Modified) TestScript.setup.action.assert
comment: (Modified) TestReport.test.action.assert
comment: (Modified) TestReport.setup.action.assert

listRuleId
type: ObjectProperty
comment: StructureMap.group.rule.rule.target.listRuleId: Internal rule reference for shared list items.
comment: StructureMap.group.rule.target.listRuleId: Internal rule reference for shared list items.
modifierExtensionProperty: listRuleId
title: StructureMap.group.rule.rule.target.listRuleId: Internal rule reference for shared list items
title: StructureMap.group.rule.target.listRuleId: Internal rule reference for shared list items

preAdmissionIdentifier
type: ObjectProperty
comment: Encounter.admission.preAdmissionIdentifier: Pre-admission identifier.
modifierExtensionProperty: preAdmissionIdentifier
title: Encounter.admission.preAdmissionIdentifier: Pre-admission identifier

participantType
type: ObjectProperty
comment: AppointmentResponse.participantType: Role of participant in the appointment.
modifierExtensionProperty: participantType
title: AppointmentResponse.participantType: Role of participant in the appointment

_related
type: ObjectProperty
comment: (Modified) ExplanationOfBenefit.related
comment: (Modified) Claim.related

SupplementSchedule
type: Class
comment: NutritionOrderSupplementComponent.SupplementSchedule: Schedule information for a supplement.
subclass of: BackboneElement
subclass of: Restriction
  max cardinality: 1
  on property: asNeededFor
subclass of: Restriction
  all values from: CodeableConcept
  on property: asNeededFor
subclass of: Restriction
  max cardinality: 1
  on property: asNeeded
subclass of: Restriction
  all values from: boolean
  on property: asNeeded
subclass of: Restriction
  all values from: Timing
  on property: timing

reAdmission
type: ObjectProperty
comment: Encounter.admission.reAdmission: Indicates that this encounter is directly related to a prior admission, often because the conditions addressed in the prior admission were not fully addressed.
modifierExtensionProperty: reAdmission
title: Encounter.admission.reAdmission: Indicates that the patient is being re-admitted

_requestURL
type: ObjectProperty
comment: (Modified) TestScript.test.action.assert.requestURL
comment: (Modified) TestScript.setup.action.assert.requestURL

_caseSensitive
type: ObjectProperty
comment: (Modified) CodeSystem.caseSensitive

Consent.provisionProvision
type: Class
comment: Provisions which provide exceptions to the base provision or subprovisions.
subclass of: BackboneElement
subclass of: Restriction
  max cardinality: 1
  on property: dataPeriod
subclass of: Restriction
  all values from: Coding
  on property: purpose
subclass of: Restriction
  all values from: Coding
  on property: documentType
subclass of: Restriction
  max cardinality: 1
  on property: expression
subclass of: Restriction
  all values from: Consent.provisionProvisionProvision
  on property: provision
subclass of: Restriction
  max cardinality: 1
  on property: period
subclass of: Restriction
  all values from: Coding
  on property: securityLabel
subclass of: Restriction
  all values from: CodeableConcept
  on property: code
subclass of: Restriction
  all values from: provisionActor
  on property: actor
subclass of: Restriction
  all values from: Period
  on property: dataPeriod
subclass of: Restriction
  all values from: provisionData
  on property: data
subclass of: Restriction
  all values from: Coding
  on property: resourceType
subclass of: Restriction
  all values from: Period
  on property: period
subclass of: Restriction
  all values from: CodeableConcept
  on property: action
subclass of: Restriction
  all values from: Expression
  on property: expression
title: Nested Exception Provisions

_chargeItem
type: ObjectProperty
comment: (Modified) Invoice.lineItem.chargeItem
comment: (Modified) DeviceDefinition.chargeItem

_withdrawalPeriod
type: ObjectProperty
comment: (Modified) AdministrableProductDefinition.routeOfAdministration.targetSpecies.withdrawalPeriod

CapabilityStatementImplementationComponent
type: Class
comment: CapabilityStatementImplementationComponent: Identifies a specific implementation instance that is described by the capability statement - i.e. a particular installation, rather than the capabilities of a software program.
subclass of: BackboneElement
subclass of: Restriction
  all values from: Reference
  on property: custodian
subclass of: Restriction
  max cardinality: 1
  on property: url
subclass of: Restriction
  all values from: markdown
  on property: description
subclass of: Restriction
  max cardinality: 1
  on property: custodian
subclass of: Restriction
  all values from: url
  on property: url
subclass of: Restriction
  cardinality: 1
  on property: description

analysis
type: ObjectProperty
comment: GenomicStudy.analysis: The details about a specific analysis that was performed in this GenomicStudy.
modifierExtensionProperty: analysis
title: GenomicStudy.analysis: Genomic Analysis Event

monitoringProgram
type: ObjectProperty
comment: MedicationKnowledge.monitoringProgram: The program under which the medication is reviewed.
modifierExtensionProperty: monitoringProgram
title: MedicationKnowledge.monitoringProgram: Program under which a medication is reviewed

_date
type: ObjectProperty
comment: (Modified) ResearchStudy.date
comment: (Modified) RegulatedAuthorization.case.application.date
comment: (Modified) StructureDefinition.date
comment: (Modified) PaymentReconciliation.allocation.date
comment: (Modified) TestScript.date
comment: (Modified) ImmunizationEvaluation.date
comment: (Modified) ImplementationGuide.date
comment: (Modified) ConceptMap.date
comment: (Modified) RegulatedAuthorization.case.date
comment: (Modified) Composition.date
comment: (Modified) SpecimenDefinition.date
comment: (Modified) PaymentReconciliation.date
comment: (Modified) Evidence.date
comment: (Modified) TestPlan.date
comment: (Modified) StructureMap.date
comment: (Modified) TerminologyCapabilities.date
comment: (Modified) CodeSystem.date
comment: (Modified) CapabilityStatement.date
comment: (Modified) ExplanationOfBenefit.procedure.date
comment: (Modified) Questionnaire.date
comment: (Modified) OperationDefinition.date
comment: (Modified) DocumentReference.date
comment: (Modified) ActivityDefinition.date
comment: (Modified) ConditionDefinition.date
comment: (Modified) CompartmentDefinition.date
comment: (Modified) GraphDefinition.date
comment: (Modified) ClaimResponse.payment.date
comment: (Modified) Citation.date
comment: (Modified) SubstanceDefinition.name.translation.official.date
comment: (Modified) MessageDefinition.date
comment: (Modified) EventDefinition.date
comment: (Modified) Immunization.reaction.date
comment: (Modified) SearchParameter.date
comment: (Modified) FamilyMemberHistory.date
comment: (Modified) NamingSystem.date
comment: (Modified) EvidenceVariable.date
comment: (Modified) GenomicStudy.analysis.date
comment: (Modified) ChargeItemDefinition.date
comment: (Modified) ImmunizationRecommendation.date
comment: (Modified) ExplanationOfBenefit.payment.date
comment: (Modified) List.entry.date
comment: (Modified) Claim.accident.date
comment: (Modified) Library.date
comment: (Modified) ArtifactAssessment.date
comment: (Modified) Invoice.date
comment: (Modified) ExampleScenario.date
comment: (Modified) ValueSet.date
comment: (Modified) DetectedIssue.mitigation.date
comment: (Modified) SubstanceDefinition.name.synonym.official.date
comment: (Modified) Permission.date
comment: (Modified) ObservationDefinition.date
comment: (Modified) Claim.procedure.date
comment: (Modified) Requirements.date
comment: (Modified) ActorDefinition.date
comment: (Modified) ExplanationOfBenefit.accident.date
comment: (Modified) List.date
comment: (Modified) Measure.date
comment: (Modified) CanonicalResource.date
comment: (Modified) SubscriptionTopic.date
comment: (Modified) SubstanceDefinition.name.official.date
comment: (Modified) VerificationResult.attestation.date
comment: (Modified) ClinicalImpression.date
comment: (Modified) MeasureReport.date
comment: (Modified) PlanDefinition.date
comment: (Modified) Consent.date

satisfiedBy
type: ObjectProperty
comment: Requirements.statement.satisfiedBy: A reference to another artifact that satisfies this requirement. This could be a Profile, extension, or an element in one of those, or a CapabilityStatement, OperationDefinition, SearchParameter, CodeSystem(/code), ValueSet, Libary etc.
modifierExtensionProperty: satisfiedBy
title: Requirements.statement.satisfiedBy: Design artifact that satisfies this requirement

artifact
type: ObjectProperty
comment: TestScript.scope.artifact: The specific conformance artifact being tested. The canonical reference can be version-specific.
comment: ArtifactAssessment.artifact
modifierExtensionProperty: artifact
title: TestScript.scope.artifact: The specific conformance artifact being tested

timing
type: ObjectProperty
comment: RequestOrchestration.action.timing
comment: Claim.supportingInfo.timing
comment: NutritionOrder.oralDiet.schedule.timing: The time period and frequency at which the diet should be given. The diet should be given for the combination of all schedules if more than one schedule is present.
comment: NutritionOrder.enteralFormula.administration.schedule.timing: The time period and frequency at which the enteral formula should be given. The enteral formula should be given for the combination of all schedules if more than one schedule is present.
comment: ActivityDefinition.timing
comment: Dosage.timing: When medication should be administered.
comment: ExplanationOfBenefit.supportingInfo.timing
comment: PlanDefinition.action.action.timing
comment: PlanDefinition.action.timing
comment: TriggerDefinition.timing
comment: RequestOrchestration.action.action.timing
comment: NutritionOrder.supplement.schedule.timing: The time period and frequency at which the supplement should be given. The supplement should be given for the combination of all schedules if more than one schedule is present.
comment: DeviceUsage.timing
modifierExtensionProperty: timing
title: NutritionOrder.enteralFormula.administration.schedule.timing: Scheduled frequency of enteral formula
title: NutritionOrder.supplement.schedule.timing: Scheduled frequency of diet
title: Dosage.timing: When medication should be administered
title: NutritionOrder.oralDiet.schedule.timing: Scheduled frequency of diet

appliesToAll
type: ObjectProperty
comment: CoverageEligibilityRequest.supportingInfo.appliesToAll: The supporting materials are applicable for all detail items, product/servce categories and specific billing codes.
modifierExtensionProperty: appliesToAll
title: CoverageEligibilityRequest.supportingInfo.appliesToAll: Applies to all items

_appointmentRequired
type: ObjectProperty
comment: (Modified) HealthcareService.appointmentRequired

_canFilterBy
type: ObjectProperty
comment: (Modified) SubscriptionTopic.canFilterBy

filter
type: ObjectProperty
comment: ValueSet.compose.exclude.filter: Select concepts by specifying a matching criterion based on the properties (including relationships) defined by the system, or on filters defined by the system. If multiple filters are specified within the include, they SHALL all be true.
comment: TerminologyCapabilities.codeSystem.version.filter: Filter Properties supported.
comment: CodeSystem.filter: A filter that can be used in a value set compose statement when selecting concepts using a filter.
comment: ValueSet.compose.include.filter: Select concepts by specifying a matching criterion based on the properties (including relationships) defined by the system, or on filters defined by the system. If multiple filters are specified within the include, they SHALL all be true.
modifierExtensionProperty: filter
title: TerminologyCapabilities.codeSystem.version.filter: Filter Properties supported
title: ValueSet.compose.include.filter: Select codes/concepts by their properties (including relationships)
title: ValueSet.compose.exclude.filter: Select codes/concepts by their properties (including relationships)
title: CodeSystem.filter: Filter that can be used in a value set

_targetNumber
type: ObjectProperty
comment: (Modified) ResearchStudy.recruitment.targetNumber

_additive
type: ObjectProperty
comment: (Modified) SpecimenDefinition.typeTested.container.additive.additive
comment: (Modified) SpecimenDefinition.typeTested.container.additive
comment: (Modified) Specimen.processing.additive
comment: (Modified) NutritionOrder.enteralFormula.additive

_management
type: ObjectProperty
comment: (Modified) ClinicalUseDefinition.interaction.management

_phylum
type: ObjectProperty
comment: (Modified) SubstanceSourceMaterial.organism.organismGeneral.phylum

_distributor
type: ObjectProperty
comment: (Modified) DeviceDefinition.packaging.packaging.distributor
comment: (Modified) DeviceDefinition.packaging.distributor

_clinicalRecommendationStatement
type: ObjectProperty
comment: (Modified) Measure.clinicalRecommendationStatement

_manifest
type: ObjectProperty
comment: (Modified) ImplementationGuide.manifest

cancellationDate
type: ObjectProperty
comment: Appointment.cancellationDate: The date/time describing when the appointment was cancelled.
modifierExtensionProperty: cancellationDate
title: Appointment.cancellationDate: When the appointment was cancelled

_doseQuantity
type: ObjectProperty
comment: (Modified) Immunization.doseQuantity

DeviceDefinitionPackagingComponentUdiDeviceIdentifier
type: Class
comment: Unique Device Identifier (UDI) Barcode string on the packaging.
subclass of: BackboneElement
subclass of: Restriction
  cardinality: 1
  on property: issuer
subclass of: Restriction
  all values from: uri
  on property: issuer
subclass of: Restriction
  all values from: string
  on property: deviceIdentifier
subclass of: Restriction
  cardinality: 1
  on property: deviceIdentifier
subclass of: Restriction
  all values from: UdiDeviceIdentifierMarketDistribution
  on property: marketDistribution
subclass of: Restriction
  cardinality: 1
  on property: jurisdiction
subclass of: Restriction
  all values from: uri
  on property: jurisdiction
title: Unique Device Identifier (UDI) Barcode string on the packaging

VerificationResult
type: Class
comment: Describes validation requirements, source(s), status and dates for one or more elements.
subclass of: DomainResource
subclass of: administrative.entity
subclass of: Restriction
  all values from: CodeableConcept
  on property: failureAction
subclass of: Restriction
  all values from: dateTime
  on property: statusDate
subclass of: Restriction
  max cardinality: 1
  on property: attestation
subclass of: Restriction
  all values from: VerificationResultPrimarySourceComponent
  on property: primarySource
subclass of: Restriction
  all values from: code
  on property: status
subclass of: Restriction
  cardinality: 1
  on property: status
subclass of: Restriction
  max cardinality: 1
  on property: nextScheduled
subclass of: Restriction
  max cardinality: 1
  on property: need
subclass of: Restriction
  all values from: date
  on property: nextScheduled
subclass of: Restriction
  max cardinality: 1
  on property: frequency
subclass of: Restriction
  all values from: CodeableConcept
  on property: validationType
subclass of: Restriction
  all values from: string
  on property: targetLocation
subclass of: Restriction
  all values from: Timing
  on property: frequency
subclass of: Restriction
  max cardinality: 1
  on property: lastPerformed
subclass of: Restriction
  all values from: CodeableConcept
  on property: validationProcess
subclass of: Restriction
  all values from: CodeableConcept
  on property: need
subclass of: Restriction
  all values from: Reference
  on property: target
subclass of: Restriction
  all values from: dateTime
  on property: lastPerformed
subclass of: Restriction
  all values from: VerificationResultAttestationComponent
  on property: attestation
subclass of: Restriction
  max cardinality: 1
  on property: failureAction
subclass of: Restriction
  max cardinality: 1
  on property: validationType
subclass of: Restriction
  all values from: VerificationResultValidatorComponent
  on property: validator
subclass of: Restriction
  max cardinality: 1
  on property: statusDate
modifierExtensionClass: VerificationResult

preference
type: ObjectProperty
comment: SpecimenDefinition.typeTested.preference: The preference for this type of conditioned specimen.
modifierExtensionProperty: preference
title: SpecimenDefinition.typeTested.preference: preferred | alternate

_asserter
type: ObjectProperty
comment: (Modified) Permission.asserter

_regulatoryIdentifier
type: ObjectProperty
comment: (Modified) DeviceDefinition.regulatoryIdentifier

molecularFormula
type: ObjectProperty
comment: SubstanceDefinition.structure.molecularFormula: An expression which states the number and type of atoms present in a molecule of a substance.
comment: SubstanceDefinition.moiety.molecularFormula: Molecular formula for this moiety of this substance, typically using the Hill system.
modifierExtensionProperty: molecularFormula
title: SubstanceDefinition.structure.molecularFormula: An expression which states the number and type of atoms present in a molecule of a substance
title: SubstanceDefinition.moiety.molecularFormula: Molecular formula for this moiety (e.g. with the Hill system)

isActive
type: ObjectProperty
comment: Medication.ingredient.isActive: Indication of whether this ingredient affects the therapeutic action of the drug.
modifierExtensionProperty: isActive
title: Medication.ingredient.isActive: Active ingredient indicator

dispenserInstruction
type: ObjectProperty
comment: MedicationRequest.dispenseRequest.dispenserInstruction: Provides additional information to the dispenser, for example, counselling to be provided to the patient.
modifierExtensionProperty: _dispenserInstruction
title: MedicationRequest.dispenseRequest.dispenserInstruction: Additional information for the dispenser

MedicationKnowledgeRelatedMedicationKnowledgeComponent
type: Class
comment: MedicationKnowledgeRelatedMedicationKnowledgeComponent: Associated or related medications. For example, if the medication is a branded product (e.g. Crestor), this is the Therapeutic Moeity (e.g. Rosuvastatin) or if this is a generic medication (e.g. Rosuvastatin), this would link to a branded product (e.g. Crestor.
subclass of: BackboneElement
subclass of: Restriction
  min cardinality: 1
  on property: reference
subclass of: Restriction
  all values from: Reference
  on property: reference
subclass of: Restriction
  cardinality: 1
  on property: type
subclass of: Restriction
  all values from: CodeableConcept
  on property: type

CapabilityStatementRestSecurityComponent
type: Class
comment: CapabilityStatementRestComponent.CapabilityStatementRestSecurityComponent: Information about security implementation from an interface perspective - what a client needs to know.
subclass of: BackboneElement
subclass of: Restriction
  max cardinality: 1
  on property: description
subclass of: Restriction
  all values from: markdown
  on property: description
subclass of: Restriction
  all values from: CodeableConcept
  on property: service
subclass of: Restriction
  max cardinality: 1
  on property: cors
subclass of: Restriction
  all values from: boolean
  on property: cors

ExampleScenarioProcessComponent.ExampleScenarioProcessStepComponentProcess.ExampleScenarioProcessStepComponent.ExampleScenarioProcessStepAlternativeComponentStepProcess
type: Class
comment: Indicates that the step is a complex sub-process with its own steps.
subclass of: BackboneElement
title: Step is nested process

initialSelected
type: ObjectProperty
comment: Questionnaire.item.item.answerOption.initialSelected: Indicates whether the answer value is selected when the list of possible answers is initially shown.
comment: Questionnaire.item.answerOption.initialSelected: Indicates whether the answer value is selected when the list of possible answers is initially shown.
modifierExtensionProperty: initialSelected
title: Questionnaire.item.item.answerOption.initialSelected: Whether option is selected by default
title: Questionnaire.item.answerOption.initialSelected: Whether option is selected by default

_preventiveAction
type: ObjectProperty
comment: (Modified) AdverseEvent.preventiveAction

DeviceDefinitionConformsToComponent
type: Class
comment: DeviceDefinitionConformsToComponent: Identifies the standards, specifications, or formal guidances for the capabilities supported by the device. The device may be certified as conformant to these specifications e.g., communication, performance, process, measurement, or specialization standards.
subclass of: BackboneElement
subclass of: Restriction
  all values from: RelatedArtifact
  on property: source
subclass of: Restriction
  all values from: CodeableConcept
  on property: specification
subclass of: Restriction
  all values from: CodeableConcept
  on property: category
subclass of: Restriction
  all values from: string
  on property: version
subclass of: Restriction
  max cardinality: 1
  on property: category
subclass of: Restriction
  cardinality: 1
  on property: specification

_MedicationStatement
type: Class
comment: (Modified) MedicationStatement
subclass of: DomainResource

_availableStartTime
type: ObjectProperty
comment: (Modified) Availability.availableTime.availableStartTime

validationType
type: ObjectProperty
comment: VerificationResult.validationType: What the target is validated against (nothing; primary source; multiple sources).
modifierExtensionProperty: _validationType
title: VerificationResult.validationType: nothing | primary | multiple

_axis
type: ObjectProperty
comment: (Modified) VisionPrescription.lensSpecification.axis

_serialNumber
type: ObjectProperty
comment: (Modified) Device.serialNumber

Narrative
type: Class
comment: A human-readable summary of the resource conveying the essential clinical and business information for the resource.
subclass of: DataType
subclass of: Restriction
  cardinality: 1
  on property: div
subclass of: Restriction
  all values from: http://hl7.org/fhir/xhtml
  on property: div
subclass of: Restriction
  cardinality: 1
  on property: status
subclass of: Restriction
  all values from: code
  on property: status
title: Human-readable summary of the resource (essential clinical and business information)

_dependency
type: ObjectProperty
comment: (Modified) TestPlan.testCase.dependency
comment: (Modified) TestPlan.dependency

endDate
type: ObjectProperty
comment: ResearchSubject.progress.endDate: The date when the state ended.
modifierExtensionProperty: _endDate
title: ResearchSubject.progress.endDate: State change date

_prognosisReference
type: ObjectProperty
comment: (Modified) ClinicalImpression.prognosisReference

_recruitment
type: ObjectProperty
comment: (Modified) ResearchStudy.recruitment

searchParam
type: ObjectProperty
comment: DataRequirement.valueFilter.searchParam: A search parameter defined on the specified type of the DataRequirement, and which searches on elements of a type compatible with the type of the valueFilter.value[x] for the filter.
comment: CapabilityStatement.rest.searchParam: Search parameters that are supported for searching all resources for implementations to support and/or make use of - either references to ones defined in the specification, or additional ones defined for/by the implementation. This is only for searches executed against the system-level endpoint.
comment: DataRequirement.codeFilter.searchParam: A token parameter that refers to a search parameter defined on the specified type of the DataRequirement, and which searches on elements of type code, Coding, or CodeableConcept.
comment: DataRequirement.dateFilter.searchParam: A date parameter that refers to a search parameter defined on the specified type of the DataRequirement, and which searches on elements of type date, dateTime, Period, Schedule, or Timing.
comment: CapabilityStatement.rest.resource.searchParam: Search parameters for implementations to support and/or make use of - either references to ones defined in the specification, or additional ones defined for/by the implementation.
modifierExtensionProperty: searchParam
title: CapabilityStatement.rest.resource.searchParam: Search parameters supported by implementation
title: CapabilityStatement.rest.searchParam: Search parameters for searching all resources
title: DataRequirement.valueFilter.searchParam: A parameter to search on
title: DataRequirement.dateFilter.searchParam: A date valued parameter to search on
title: DataRequirement.codeFilter.searchParam: A coded (token) parameter to search on

_usageInstruction
type: ObjectProperty
comment: (Modified) DeviceDispense.usageInstruction
comment: (Modified) DeviceDefinition.guideline.usageInstruction
comment: (Modified) BiologicallyDerivedProductDispense.usageInstruction

_generation
type: ObjectProperty
comment: (Modified) ImplementationGuide.definition.page.page.generation
comment: (Modified) ImplementationGuide.definition.page.generation

artifactAssessment
type: ObjectProperty
comment: Citation.citedArtifact.classification.artifactAssessment: Complex or externally created classification.
modifierExtensionProperty: artifactAssessment
title: Citation.citedArtifact.classification.artifactAssessment: Complex or externally created classification

complete
type: ObjectProperty
comment: Citation.citedArtifact.contributorship.complete: Indicates if the list includes all authors and/or contributors.
modifierExtensionProperty: complete
title: Citation.citedArtifact.contributorship.complete: Indicates if the list includes all authors and/or contributors

_dependent
type: ObjectProperty
comment: (Modified) StructureMap.group.rule.dependent
comment: (Modified) StructureMap.group.rule.rule.dependent
comment: (Modified) Coverage.dependent

_due
type: ObjectProperty
comment: (Modified) PlanDefinition.goal.target.due
comment: (Modified) Goal.target.due

_replaces
type: ObjectProperty
comment: (Modified) DeviceRequest.replaces
comment: (Modified) ChargeItemDefinition.replaces
comment: (Modified) RequestOrchestration.replaces
comment: (Modified) MessageDefinition.replaces
comment: (Modified) ServiceRequest.replaces
comment: (Modified) CommunicationRequest.replaces
comment: (Modified) Appointment.replaces
comment: (Modified) CarePlan.replaces

EvidenceStatisticModelCharacteristicComponent
type: Class
comment: EvidenceStatisticComponent.EvidenceStatisticModelCharacteristicComponent: A component of the method to generate the statistic.
subclass of: BackboneElement
subclass of: Restriction
  all values from: CodeableConcept
  on property: code
subclass of: Restriction
  all values from: EvidenceStatisticModelCharacteristicVariableComponent
  on property: variable
subclass of: Restriction
  cardinality: 1
  on property: code
subclass of: Restriction
  all values from: EvidenceStatisticComponent.EvidenceStatisticModelCharacteristicComponentAttributeEstimate
  on property: attributeEstimate
subclass of: Restriction
  all values from: SimpleQuantity
  on property: value
subclass of: Restriction
  max cardinality: 1
  on property: value

_friday
type: ObjectProperty
comment: (Modified) Appointment.recurrenceTemplate.weeklyTemplate.friday

orderedBy
type: ObjectProperty
comment: EvidenceReport.section.orderedBy: Specifies the order applied to the items in the section entries.
comment: EvidenceReport.section.section.orderedBy: Specifies the order applied to the items in the section entries.
comment: Composition.section.section.orderedBy: Specifies the order applied to the items in the section entries.
comment: List.orderedBy: What order applies to the items in the list.
comment: Composition.section.orderedBy: Specifies the order applied to the items in the section entries.
modifierExtensionProperty: orderedBy
title: EvidenceReport.section.orderedBy: Order of section entries
title: Composition.section.section.orderedBy: Order of section entries
title: List.orderedBy: What order the list has
title: EvidenceReport.section.section.orderedBy: Order of section entries
title: Composition.section.orderedBy: Order of section entries

_modality
type: ObjectProperty
comment: (Modified) ImagingStudy.series.modality
comment: (Modified) ImagingStudy.modality
comment: (Modified) DocumentReference.modality

expirationType
type: ObjectProperty
comment: Contract.expirationType: Event resulting in discontinuation or termination of this Contract instance by one or more parties to the contract.
modifierExtensionProperty: _expirationType
title: Contract.expirationType: Contract cessation cause

party
type: ObjectProperty
comment: Contract.signer.party: Party which is a signator to this Contract.
comment: ExplanationOfBenefit.payee.party: Reference to the individual or organization to whom any payment will be made.
comment: Claim.payee.party: Reference to the individual or organization to whom any payment will be made.
comment: Coverage.paymentBy.party: The list of parties providing non-insurance payment for the treatment costs.
comment: ResearchStudy.associatedParty.party: Individual or organization associated with study (use practitionerRole to specify their organisation).
comment: DocumentReference.attester.party: Who attested the document in the specified way.
comment: Account.guarantor.party: The entity who is responsible.
comment: Contract.term.offer.party: Offer Recipient.
comment: Composition.attester.party: Who attested the composition in the specified way.
comment: Contract.term.group.offer.party: Offer Recipient.
sub property of: who.author
sub property of: who.witness
modifierExtensionProperty: party
title: ResearchStudy.associatedParty.party: Individual or organization associated with study (use practitionerRole to specify their organisation)
title: Composition.attester.party: Who attested the composition
title: Contract.signer.party: Contract Signatory Party
title: Coverage.paymentBy.party: Parties performing self-payment
title: Claim.payee.party: Recipient reference
title: Account.guarantor.party: Responsible entity
title: DocumentReference.attester.party: Who attested the document
title: Contract.term.group.offer.party: Offer Recipient
title: ExplanationOfBenefit.payee.party: Recipient reference
title: Contract.term.offer.party: Offer Recipient

_objective
type: ObjectProperty
comment: (Modified) ResearchStudy.objective

_totalNet
type: ObjectProperty
comment: (Modified) Invoice.totalNet

_adherence
type: ObjectProperty
comment: (Modified) MedicationStatement.adherence
comment: (Modified) DeviceUsage.adherence

_cardinalityBehavior
type: ObjectProperty
comment: (Modified) RequestOrchestration.action.action.cardinalityBehavior
comment: (Modified) RequestOrchestration.action.cardinalityBehavior
comment: (Modified) PlanDefinition.action.action.cardinalityBehavior
comment: (Modified) PlanDefinition.action.cardinalityBehavior

startDate
type: ObjectProperty
comment: ResearchSubject.progress.startDate: The date when the new status started.
comment: GenomicStudy.startDate: When the genomic study was started.
modifierExtensionProperty: _startDate
title: ResearchSubject.progress.startDate: State change date
title: GenomicStudy.startDate: When the genomic study was started

basis
type: ObjectProperty
comment: RegulatedAuthorization.basis: The legal or regulatory framework against which this authorization is granted, or other reasons for it.
comment: Permission.justification.basis: This would be a codeableconcept, or a coding, which can be constrained to , for example, the 6 grounds for processing in GDPR.
comment: Measure.basis: The population basis specifies the type of elements in the population. For a subject-based measure, this is boolean (because the subject and the population basis are the same, and the population criteria define yes/no values for each individual in the population). For measures that have a population basis that is different than the subject, this element specifies the type of the population basis. For example, an encounter-based measure has a subject of Patient and a population basis of Encounter, and the population criteria all return lists of Encounters.
comment: Measure.group.basis: The population basis specifies the type of elements in the population. For a subject-based measure, this is boolean (because the subject and the population basis are the same, and the population criteria define yes/no values for each individual in the population). For measures that have a population basis that is different than the subject, this element specifies the type of the population basis. For example, an encounter-based measure has a subject of Patient and a population basis of Encounter, and the population criteria all return lists of Encounters.
comment: ClinicalImpression.finding.basis: Which investigations support finding or diagnosis.
comment: Ingredient.substance.strength.basis: A code that indicates if the strength is, for example, based on the ingredient substance as stated or on the substance base (when the ingredient is a salt).
comment: RiskAssessment.basis: Indicates the source data considered as part of the assessment (for example, FamilyHistory, Observations, Procedures, Conditions, etc.).
modifierExtensionProperty: basis
title: ClinicalImpression.finding.basis: Which investigations support finding
title: RiskAssessment.basis: Information used in assessment
title: RegulatedAuthorization.basis: The legal/regulatory framework or reasons under which this authorization is granted
title: Ingredient.substance.strength.basis: A code that indicates if the strength is, for example, based on the ingredient substance as stated or on the substance base (when the ingredient is a salt)
title: Permission.justification.basis: The regulatory grounds upon which this Permission builds
title: Measure.basis: Population basis
title: Measure.group.basis: Population basis

_minutesDuration
type: ObjectProperty
comment: (Modified) Appointment.minutesDuration

instruction
type: ObjectProperty
comment: SpecimenDefinition.typeTested.handling.instruction: Additional textual instructions for the preservation or transport of the specimen. For instance, 'Protect from light exposure'.
comment: NutritionOrder.oralDiet.instruction: Free text or additional instructions or information pertaining to the oral diet.
comment: ServiceRequest.patientInstruction.instruction
comment: NutritionOrder.supplement.instruction: Free text or additional instructions or information pertaining to the oral supplement.
modifierExtensionProperty: instruction
title: NutritionOrder.supplement.instruction: Instructions or additional information about the oral supplement
title: SpecimenDefinition.typeTested.handling.instruction: Preservation instruction
title: NutritionOrder.oralDiet.instruction: Instructions or additional information about the oral diet

_targetDisease
type: ObjectProperty
comment: (Modified) ImmunizationRecommendation.recommendation.targetDisease
comment: (Modified) ImmunizationEvaluation.targetDisease
comment: (Modified) Immunization.protocolApplied.targetDisease

eventTrigger
type: ObjectProperty
comment: SubscriptionTopic.eventTrigger: Event definition which can be used to trigger the SubscriptionTopic.
modifierExtensionProperty: eventTrigger
title: SubscriptionTopic.eventTrigger: Event definitions the SubscriptionTopic

closure
type: ObjectProperty
comment: TerminologyCapabilities.closure: Whether the $closure operation is supported.
modifierExtensionProperty: _closure
title: TerminologyCapabilities.closure: Information about the [ConceptMap/$closure](conceptmap-operation-closure.html) operation

numberOfParticipants
type: ObjectProperty
comment: Evidence.statistic.sampleSize.numberOfParticipants: A human-readable string to clarify or explain concepts about the sample size.
modifierExtensionProperty: _numberOfParticipants
title: Evidence.statistic.sampleSize.numberOfParticipants: Cumulative number of participants

businessArrangement
type: ObjectProperty
comment: CoverageEligibilityRequest.insurance.businessArrangement: A business agreement number established between the provider and the insurer for special business processing purposes.
comment: ClaimResponse.insurance.businessArrangement: A business agreement number established between the provider and the insurer for special business processing purposes.
comment: Claim.insurance.businessArrangement: A business agreement number established between the provider and the insurer for special business processing purposes.
modifierExtensionProperty: _businessArrangement
title: CoverageEligibilityRequest.insurance.businessArrangement: Additional provider contract number
title: ClaimResponse.insurance.businessArrangement: Additional provider contract number
title: Claim.insurance.businessArrangement: Additional provider contract number

requesterLinkId
type: ObjectProperty
comment: Contract.term.group.action.requesterLinkId: Id [identifier??] of the clause or question text related to the requester of this action in the referenced form or QuestionnaireResponse.
comment: Contract.term.action.requesterLinkId: Id [identifier??] of the clause or question text related to the requester of this action in the referenced form or QuestionnaireResponse.
modifierExtensionProperty: requesterLinkId
title: Contract.term.group.action.requesterLinkId: Pointer to specific item
title: Contract.term.action.requesterLinkId: Pointer to specific item

_programEligibility
type: ObjectProperty
comment: (Modified) Immunization.programEligibility

_average
type: ObjectProperty
comment: (Modified) SubstancePolymer.repeat.repeatUnit.degreeOfPolymerisation.average

proxySignature
type: ObjectProperty
comment: VerificationResult.attestation.proxySignature: Signed assertion by the proxy entity indicating that they have the right to submit attested information on behalf of the attestation source.
modifierExtensionProperty: _proxySignature
title: VerificationResult.attestation.proxySignature: Proxy signature (digital or image)

_assessmentMethod
type: ObjectProperty
comment: (Modified) AdverseEvent.suspectEntity.causality.assessmentMethod

_series
type: ObjectProperty
comment: (Modified) ImmunizationRecommendation.recommendation.series
comment: (Modified) ImmunizationEvaluation.series
comment: (Modified) Immunization.protocolApplied.series
comment: (Modified) ImagingStudy.series

_performingOrganization
type: ObjectProperty
comment: (Modified) ChargeItem.performingOrganization

frames
type: ObjectProperty
comment: Attachment.frames: The number of frames in a photo. This is used with a multi-page fax, or an imaging acquisition context that takes multiple slices in a single image, or an animated gif. If there is more than one frame, this SHALL have a value in order to alert interface software that a multi-frame capable rendering widget is required.
modifierExtensionProperty: frames
title: Attachment.frames: Number of frames if > 1 (photo)

_paternalOrganismName
type: ObjectProperty
comment: (Modified) SubstanceSourceMaterial.organism.hybrid.paternalOrganismName

inputProfile
type: ObjectProperty
comment: OperationDefinition.inputProfile: Additional validation information for the in parameters - a single profile that covers all the parameters. The profile is a constraint on the parameters resource as a whole.
modifierExtensionProperty: inputProfile
title: OperationDefinition.inputProfile: Validation information for in parameters

_guarantor
type: ObjectProperty
comment: (Modified) Account.guarantor

_human
type: ObjectProperty
comment: (Modified) ElementDefinition.constraint.human

NutritionProductCharacteristicComponent
type: Class
comment: NutritionProductCharacteristicComponent: Specifies descriptive properties of the nutrition product.
subclass of: BackboneElement
subclass of:
  union of: Restriction
    all values from: CodeableConcept
    on property: value
  union of: Restriction
    cardinality: 1
    on property: value
  union of: Restriction
    all values from: string
    on property: value
  union of: Restriction
    cardinality: 1
    on property: value
  union of: Restriction
    all values from: SimpleQuantity
    on property: value
  union of: Restriction
    cardinality: 1
    on property: value
  union of: Restriction
    all values from: base64Binary
    on property: value
  union of: Restriction
    cardinality: 1
    on property: value
  union of: Restriction
    all values from: Attachment
    on property: value
  union of: Restriction
    cardinality: 1
    on property: value
  union of: Restriction
    all values from: boolean
    on property: value
  union of: Restriction
    cardinality: 1
    on property: value
subclass of: Restriction
  cardinality: 1
  on property: type
subclass of: Restriction
  all values from: CodeableConcept
  on property: type

_orderDetail
type: ObjectProperty
comment: (Modified) ServiceRequest.orderDetail

maxParticipants
type: ObjectProperty
comment: VirtualServiceDetail.maxParticipants: Maximum number of participants supported by the virtual service.
modifierExtensionProperty: maxParticipants
title: VirtualServiceDetail.maxParticipants: Maximum number of participants supported by the virtual service

ClinicalUseDefinitionUndesirableEffectComponent
type: Class
comment: ClinicalUseDefinitionUndesirableEffectComponent: Describe the possible undesirable effects (negative outcomes) from the use of the medicinal product as treatment.
subclass of: BackboneElement
subclass of: Restriction
  max cardinality: 1
  on property: classification
subclass of: Restriction
  all values from: CodeableConcept
  on property: frequencyOfOccurrence
subclass of: Restriction
  max cardinality: 1
  on property: frequencyOfOccurrence
subclass of: Restriction
  all values from: CodeableReference
  on property: symptomConditionEffect
subclass of: Restriction
  all values from: CodeableConcept
  on property: classification
subclass of: Restriction
  max cardinality: 1
  on property: symptomConditionEffect

_observed
type: ObjectProperty
comment: (Modified) Evidence.variableDefinition.observed

validityPeriod
type: ObjectProperty
comment: RegulatedAuthorization.validityPeriod: The time period in which the regulatory approval, clearance or licencing is in effect. As an example, a Marketing Authorization includes the date of authorization and/or an expiration date.
comment: MedicationRequest.dispenseRequest.validityPeriod: This indicates the validity period of a prescription (stale dating the Prescription).
modifierExtensionProperty: _validityPeriod
title: RegulatedAuthorization.validityPeriod: The time period in which the regulatory approval etc. is in effect, e.g. a Marketing Authorization includes the date of authorization and/or expiration date
title: MedicationRequest.dispenseRequest.validityPeriod: Time period supply is authorized for

Instance transmitted on invocation
type: Class
comment: A reference to the instance that is transmitted from receiver to requester as part of the operation's synchronous response (if any).
comment: A reference to the instance that is transmitted from requester to receiver as part of the invocation of the operation.
label: ExampleScenarioProcessComponent.ExampleScenarioProcessStepComponent.ExampleScenarioProcessStepAlternativeComponentStepProcess.ExampleScenarioProcessStepComponent.ExampleScenarioProcessStepOperationComponentContainedInstance
subclass of: BackboneElement
subclass of: Restriction
  max cardinality: 1
  on property: versionReference
subclass of: Restriction
  all values from: string
  on property: versionReference
subclass of: Restriction
  all values from: string
  on property: versionReference
subclass of: Restriction
  cardinality: 1
  on property: instanceReference
subclass of: Restriction
  all values from: string
  on property: instanceReference
subclass of: Restriction
  cardinality: 1
  on property: instanceReference
subclass of: Restriction
  max cardinality: 1
  on property: versionReference
subclass of: Restriction
  all values from: string
  on property: instanceReference
title: Instance transmitted on invocation response

ComputableLanguage
type: Class
comment: Contract.ComputableLanguage: List of Computable Policy Rule Language Representations of this Contract.
subclass of: BackboneElement
subclass of:
  union of: Restriction
    all values from: Attachment
    on property: content
  union of: Restriction
    cardinality: 1
    on property: content
  union of: Restriction
    all values from: Reference
    on property: content
  union of: Restriction
    cardinality: 1
    on property: content

surfaceOrientation
type: ObjectProperty
comment: BodyStructure.excludedStructure.bodyLandmarkOrientation.surfaceOrientation: The surface area a body location is in relation to a landmark.
comment: BodyStructure.includedStructure.bodyLandmarkOrientation.surfaceOrientation: The surface area a body location is in relation to a landmark.
sub property of: what
modifierExtensionProperty: surfaceOrientation
title: BodyStructure.excludedStructure.bodyLandmarkOrientation.surfaceOrientation: Relative landmark surface orientation
title: BodyStructure.includedStructure.bodyLandmarkOrientation.surfaceOrientation: Relative landmark surface orientation

_Provenance
type: Class
comment: (Modified) Provenance
subclass of: DomainResource

testRun
type: ObjectProperty
comment: TestPlan.testCase.testRun: The actual test to be executed.
modifierExtensionProperty: testRun
title: TestPlan.testCase.testRun: The actual test to be executed

SubstanceProtein
type: Class
comment: A SubstanceProtein is defined as a single unit of a linear amino acid sequence, or a combination of subunits that are either covalently linked or have a defined invariant stoichiometric relationship. This includes all synthetic, recombinant and purified SubstanceProteins of defined sequence, whether the use is therapeutic or prophylactic. This set of elements will be used to describe albumins, coagulation factors, cytokines, growth factors, peptide/SubstanceProtein hormones, enzymes, toxins, toxoids, recombinant vaccines, and immunomodulators.
subclass of: DomainResource
subclass of: administrative.medication
subclass of: Restriction
  max cardinality: 1
  on property: numberOfSubunits
subclass of: Restriction
  all values from: CodeableConcept
  on property: sequenceType
subclass of: Restriction
  all values from: integer
  on property: numberOfSubunits
subclass of: Restriction
  all values from: string
  on property: disulfideLinkage
subclass of: Restriction
  max cardinality: 1
  on property: sequenceType
subclass of: Restriction
  all values from: SubstanceProteinSubunitComponent
  on property: subunit
modifierExtensionClass: SubstanceProtein

_focalDevice
type: ObjectProperty
comment: (Modified) Procedure.focalDevice

_operationType
type: ObjectProperty
comment: (Modified) InventoryReport.operationType

context
type: ObjectProperty
comment: Contract.term.group.asset.context: Circumstance of the asset.
comment: ObservationDefinition.qualifiedValue.context: A concept defining the context for this set of qualified values.
comment: DocumentReference.context: Describes the clinical encounter or type of care that the document content is associated with.
comment: StructureMap.group.rule.target.context: Variable this rule applies to.
comment: ObservationDefinition.component.qualifiedValue.context: A concept defining the context for this set of qualified values.
comment: DeviceUsage.context: The encounter or episode of care that establishes the context for this device use statement.
comment: Contract.term.asset.context: Circumstance of the asset.
comment: StructureMap.group.rule.rule.target.context: Variable this rule applies to.
comment: Contract.term.group.action.context: Encounter or Episode with primary association to the specified term activity.
comment: Contract.term.action.context: Encounter or Episode with primary association to the specified term activity.
comment: StructureMap.group.rule.source.context: Type or variable this rule applies to.
comment: StructureMap.group.rule.rule.source.context: Type or variable this rule applies to.
comment: StructureDefinition.context: Identifies the types of resource or data type elements to which the extension can be applied. For more guidance on using the 'context' element, see the [defining extensions page](defining-extensions.html#context).
sub property of: context
modifierExtensionProperty: context
title: Contract.term.group.asset.context: Circumstance of the asset
title: StructureMap.group.rule.rule.target.context: Variable this rule applies to
title: ObservationDefinition.qualifiedValue.context: Context qualifier for the set of qualified values
title: StructureMap.group.rule.source.context: Type or variable this rule applies to
title: Contract.term.asset.context: Circumstance of the asset
title: StructureMap.group.rule.rule.source.context: Type or variable this rule applies to
title: DeviceUsage.context: The encounter or episode of care that establishes the context for this device use statement
title: StructureMap.group.rule.target.context: Variable this rule applies to
title: ObservationDefinition.component.qualifiedValue.context: Context qualifier for the set of qualified values
title: DocumentReference.context: Context of the document content
title: Contract.term.action.context: Episode associated with action
title: Contract.term.group.action.context: Episode associated with action
title: StructureDefinition.context: If an extension, where it can be used in instances

occurrenceDateTime
type: ObjectProperty
comment: GuidanceResponse.occurrenceDateTime: Indicates when the guidance response was processed.
sub property of: when.done
modifierExtensionProperty: occurrenceDateTime
title: GuidanceResponse.occurrenceDateTime: When the guidance response was processed

DetectedIssueEvidenceComponent
type: Class
comment: DetectedIssueEvidenceComponent: Supporting evidence or manifestations that provide the basis for identifying the detected issue such as a GuidanceResponse or MeasureReport.
subclass of: BackboneElement
subclass of: Restriction
  all values from: Reference
  on property: detail
subclass of: Restriction
  all values from: CodeableConcept
  on property: code

_ExplanationOfBenefit
type: Class
comment: (Modified) ExplanationOfBenefit
subclass of: DomainResource

validated
type: ObjectProperty
comment: TestScript.metadata.capability.validated: Whether or not the test execution will validate the given capabilities of the server in order for this test script to execute.
modifierExtensionProperty: validated
title: TestScript.metadata.capability.validated: Are the capabilities validated?

_subunit
type: ObjectProperty
comment: (Modified) SubstanceProtein.subunit.subunit
comment: (Modified) SubstanceProtein.subunit
comment: (Modified) SubstanceNucleicAcid.subunit.subunit
comment: (Modified) SubstanceNucleicAcid.subunit

EvidenceStatisticAttributeEstimateComponent
type: Class
comment: EvidenceStatisticComponent.EvidenceStatisticAttributeEstimateComponent: A statistical attribute of the statistic such as a measure of heterogeneity.
subclass of: BackboneElement
subclass of: Restriction
  all values from: markdown
  on property: description
subclass of: Restriction
  max cardinality: 1
  on property: type
subclass of: Restriction
  all values from: Quantity
  on property: quantity
subclass of: Restriction
  all values from: Range
  on property: range
subclass of: Restriction
  max cardinality: 1
  on property: quantity
subclass of: Restriction
  max cardinality: 1
  on property: description
subclass of: Restriction
  all values from: Annotation
  on property: note
subclass of: Restriction
  all values from: decimal
  on property: level
subclass of: Restriction
  max cardinality: 1
  on property: level
subclass of: Restriction
  all values from: EvidenceStatisticComponent.EvidenceStatisticAttributeEstimateComponentAttributeEstimate
  on property: attributeEstimate
subclass of: Restriction
  all values from: CodeableConcept
  on property: type
subclass of: Restriction
  max cardinality: 1
  on property: range

replacedSequence
type: ObjectProperty
comment: MolecularSequence.relative.edit.replacedSequence: Allele in the starting sequence. Nucleotide(s)/amino acids from start position of sequence to stop position of sequence on the positive (+) strand of the starting sequence. When the sequence type is DNA, it should be the sequence on the positive (+) strand. This will lay in the range between variant.start and variant.end.
modifierExtensionProperty: replacedSequence
title: MolecularSequence.relative.edit.replacedSequence: Allele in the starting sequence

specimen
type: ObjectProperty
comment: ObservationDefinition.specimen: The kind of specimen that this type of observation is produced on.
comment: GenomicStudy.analysis.specimen: The specimen used in the analysis event.
comment: ServiceRequest.specimen: One or more specimens that the laboratory procedure will use.
comment: ImagingStudy.series.specimen: The specimen imaged, e.g., for whole slide imaging of a biopsy.
comment: MolecularSequence.specimen: Specimen used for sequencing.
comment: DiagnosticReport.specimen: Details about the specimens on which this diagnostic report is based.
comment: Observation.specimen: The specimen that was used when this observation was made.
modifierExtensionProperty: specimen
title: Observation.specimen: Specimen used for this observation
title: ServiceRequest.specimen: Procedure Samples
title: ImagingStudy.series.specimen: Specimen imaged
title: ObservationDefinition.specimen: Kind of specimen used by this type of observation
title: DiagnosticReport.specimen: Specimens this report is based on
title: GenomicStudy.analysis.specimen: The specimen used in the analysis event
title: MolecularSequence.specimen: Specimen used for sequencing

EvidenceStatisticComponent.EvidenceStatisticAttributeEstimateComponentAttributeEstimateAttributeEstimate
type: Class
comment: A nested attribute estimate; which is the attribute estimate of an attribute estimate.
subclass of: BackboneElement
title: A nested attribute estimate; which is the attribute estimate of an attribute estimate

rater
type: ObjectProperty
comment: Evidence.certainty.subcomponent.rater: Individual or group who did the rating.
comment: Evidence.certainty.rater: Individual or group who did the rating.
modifierExtensionProperty: _rater
title: Evidence.certainty.subcomponent.rater: Individual or group who did the rating
title: Evidence.certainty.rater: Individual or group who did the rating

relatedMedicationKnowledge
type: ObjectProperty
comment: MedicationKnowledge.relatedMedicationKnowledge: Associated or related medications. For example, if the medication is a branded product (e.g. Crestor), this is the Therapeutic Moeity (e.g. Rosuvastatin) or if this is a generic medication (e.g. Rosuvastatin), this would link to a branded product (e.g. Crestor.
modifierExtensionProperty: _relatedMedicationKnowledge
title: MedicationKnowledge.relatedMedicationKnowledge: Associated or related medication information

lastModified
type: ObjectProperty
comment: Transport.lastModified: The date and time of last modification to this transport.
comment: Task.lastModified: The date and time of last modification to this task.
comment: Bundle.entry.response.lastModified: The date/time that the resource was modified on the server.
modifierExtensionProperty: lastModified
title: Transport.lastModified: Transport Last Modified Date
title: Task.lastModified: Task Last Modified Date
title: Bundle.entry.response.lastModified: Server's date time modified

RequestOrchestrationActionParticipantComponent
type: Class
comment: RequestOrchestrationActionComponent.RequestOrchestrationActionParticipantComponent: The participant that should perform or be responsible for this action.
comment: RequestOrchestrationActionComponentAction.RequestOrchestrationActionParticipantComponent: The participant that should perform or be responsible for this action.
subclass of: BackboneElement
subclass of:
  union of: Restriction
    all values from: canonical
    on property: actor
  union of: Restriction
    max cardinality: 1
    on property: actor
  union of: Restriction
    all values from: Reference
    on property: actor
  union of: Restriction
    max cardinality: 1
    on property: actor
subclass of: Restriction
  max cardinality: 1
  on property: type
subclass of: Restriction
  max cardinality: 1
  on property: typeReference
subclass of: Restriction
  all values from: canonical
  on property: typeCanonical
subclass of: Restriction
  max cardinality: 1
  on property: typeReference
subclass of: Restriction
  max cardinality: 1
  on property: type
subclass of: Restriction
  all values from: canonical
  on property: typeCanonical
subclass of: Restriction
  all values from: CodeableConcept
  on property: role
subclass of: Restriction
  max cardinality: 1
  on property: typeCanonical
subclass of: Restriction
  all values from: CodeableConcept
  on property: function
subclass of: Restriction
  max cardinality: 1
  on property: role
subclass of: Restriction
  max cardinality: 1
  on property: role
subclass of: Restriction
  max cardinality: 1
  on property: function
subclass of: Restriction
  all values from: Reference
  on property: typeReference
subclass of: Restriction
  all values from: Reference
  on property: typeReference
subclass of: Restriction
  all values from: code
  on property: type
subclass of: Restriction
  all values from: code
  on property: type
subclass of:
  union of: Restriction
    all values from: canonical
    on property: actor
  union of: Restriction
    max cardinality: 1
    on property: actor
  union of: Restriction
    all values from: Reference
    on property: actor
  union of: Restriction
    max cardinality: 1
    on property: actor
subclass of: Restriction
  all values from: CodeableConcept
  on property: function
subclass of: Restriction
  max cardinality: 1
  on property: typeCanonical
subclass of: Restriction
  max cardinality: 1
  on property: function
subclass of: Restriction
  all values from: CodeableConcept
  on property: role

_informationType
type: ObjectProperty
comment: (Modified) ArtifactAssessment.content.component.informationType
comment: (Modified) ArtifactAssessment.content.informationType

citation
type: ObjectProperty
comment: Citation.citedArtifact.relatesTo.citation: A bibliographic citation for the related artifact. This text SHOULD be formatted according to an accepted citation format.
comment: RelatedArtifact.citation: A bibliographic citation for the related artifact. This text SHOULD be formatted according to an accepted citation format.
modifierExtensionProperty: citation
title: Citation.citedArtifact.relatesTo.citation: Bibliographic citation for the artifact
title: RelatedArtifact.citation: Bibliographic citation for the artifact

paymentStatus
type: ObjectProperty
comment: PaymentNotice.paymentStatus: A code indicating whether payment has been sent or cleared.
modifierExtensionProperty: _paymentStatus
title: PaymentNotice.paymentStatus: Issued or cleared Status of the payment

treatment
type: ObjectProperty
comment: ClinicalUseDefinition.indication.otherTherapy.treatment: Reference to a specific medication (active substance, medicinal product or class of products, biological, food etc.) as part of an indication or contraindication.
comment: ClinicalUseDefinition.contraindication.otherTherapy.treatment: Reference to a specific medication (active substance, medicinal product or class of products, biological, food etc.) as part of an indication or contraindication.
modifierExtensionProperty: _treatment
title: ClinicalUseDefinition.indication.otherTherapy.treatment: Reference to a specific medication, substance etc. as part of an indication or contraindication
title: ClinicalUseDefinition.contraindication.otherTherapy.treatment: Reference to a specific medication, substance etc. as part of an indication or contraindication

_initial
type: ObjectProperty
comment: (Modified) Questionnaire.item.item.initial
comment: (Modified) Questionnaire.item.initial

priceComponent
type: ObjectProperty
comment: Invoice.lineItem.priceComponent: The price for a ChargeItem may be calculated as a base price with surcharges/deductions that apply in certain conditions. A ChargeItemDefinition resource that defines the prices, factors and conditions that apply to a billing code is currently under development. The priceComponent element can be used to offer transparency to the recipient of the Invoice as to how the prices have been calculated.
comment: ChargeItemDefinition.propertyGroup.priceComponent: The price for a ChargeItem may be calculated as a base price with surcharges/deductions that apply in certain conditions. A ChargeItemDefinition resource that defines the prices, factors and conditions that apply to a billing code is currently under development. The priceComponent element can be used to offer transparency to the recipient of the Invoice of how the prices have been calculated.
modifierExtensionProperty: _priceComponent
title: Invoice.lineItem.priceComponent: Components of total line item price
title: ChargeItemDefinition.propertyGroup.priceComponent: Components of total line item price

ConceptMapGroupComponent.SourceElement.TargetElementDependsOn
type: Class
comment: Product is the output of a ConceptMap that provides additional values that go in other attributes / data elemnts of the target data.
subclass of: BackboneElement
subclass of: Restriction
  cardinality: 1
  on property: attribute
subclass of: Restriction
  max cardinality: 1
  on property: valueSet
subclass of: Restriction
  all values from: canonical
  on property: valueSet
subclass of: Restriction
  all values from: code
  on property: attribute
subclass of:
  union of: Restriction
    all values from: code
    on property: value
  union of: Restriction
    max cardinality: 1
    on property: value
  union of: Restriction
    all values from: Coding
    on property: value
  union of: Restriction
    max cardinality: 1
    on property: value
  union of: Restriction
    all values from: string
    on property: value
  union of: Restriction
    max cardinality: 1
    on property: value
  union of: Restriction
    all values from: boolean
    on property: value
  union of: Restriction
    max cardinality: 1
    on property: value
  union of: Restriction
    all values from: Quantity
    on property: value
  union of: Restriction
    max cardinality: 1
    on property: value
title: Other data elements that this mapping also produces

_Linkage
type: Class
comment: (Modified) Linkage
subclass of: DomainResource

_indicationGuideline
type: ObjectProperty
comment: (Modified) MedicationKnowledge.indicationGuideline

SubstanceSourceMaterial
type: Class
comment: Source material shall capture information on the taxonomic and anatomical origins as well as the fraction of a material that can result in or can be modified to form a substance. This set of data elements shall be used to define polymer substances isolated from biological matrices. Taxonomic and anatomical origins shall be described using a controlled vocabulary as required. This information is captured for naturally derived polymers ( . starch) and structurally diverse substances. For Organisms belonging to the Kingdom Plantae the Substance level defines the fresh material of a single species or infraspecies, the Herbal Drug and the Herbal preparation. For Herbal preparations, the fraction information will be captured at the Substance information level and additional information for herbal extracts will be captured at the Specified Substance Group 1 information level. See for further explanation the Substance Class: Structurally Diverse and the herbal annex.
subclass of: administrative.medication
subclass of: DomainResource
subclass of: Restriction
  max cardinality: 1
  on property: developmentStage
subclass of: Restriction
  all values from: CodeableConcept
  on property: developmentStage
subclass of: Restriction
  max cardinality: 1
  on property: sourceMaterialClass
subclass of: Restriction
  all values from: string
  on property: parentSubstanceName
subclass of: Restriction
  all values from: CodeableConcept
  on property: sourceMaterialState
subclass of: Restriction
  all values from: SubstanceSourceMaterialFractionDescriptionComponent
  on property: fractionDescription
subclass of: Restriction
  all values from: SubstanceSourceMaterialOrganismComponent
  on property: organism
subclass of: Restriction
  all values from: string
  on property: geographicalLocation
subclass of: Restriction
  all values from: SubstanceSourceMaterialPartDescriptionComponent
  on property: partDescription
subclass of: Restriction
  max cardinality: 1
  on property: sourceMaterialType
subclass of: Restriction
  all values from: Identifier
  on property: organismId
subclass of: Restriction
  max cardinality: 1
  on property: organism
subclass of: Restriction
  all values from: Identifier
  on property: parentSubstanceId
subclass of: Restriction
  all values from: CodeableConcept
  on property: countryOfOrigin
subclass of: Restriction
  all values from: string
  on property: organismName
subclass of: Restriction
  max cardinality: 1
  on property: organismName
subclass of: Restriction
  all values from: CodeableConcept
  on property: sourceMaterialType
subclass of: Restriction
  max cardinality: 1
  on property: sourceMaterialState
subclass of: Restriction
  all values from: CodeableConcept
  on property: sourceMaterialClass
subclass of: Restriction
  max cardinality: 1
  on property: organismId
modifierExtensionClass: SubstanceSourceMaterial

_conditionalRead
type: ObjectProperty
comment: (Modified) CapabilityStatement.rest.resource.conditionalRead

managingEntity
type: ObjectProperty
comment: Subscription.managingEntity: Entity with authorization to make subsequent revisions to the Subscription and also determines what data the subscription is authorized to disclose.
comment: Group.managingEntity: Entity responsible for defining and maintaining Group characteristics and/or registered members.
sub property of: who.author
sub property of: who.witness
modifierExtensionProperty: _managingEntity
title: Subscription.managingEntity: Entity responsible for Subscription changes
title: Group.managingEntity: Entity that is the custodian of the Group's definition

EvidenceVariableCharacteristicDefinitionByTypeAndValueComponent
type: Class
comment: EvidenceVariableCharacteristicComponent.EvidenceVariableCharacteristicDefinitionByCombinationComponentCharacteristic.EvidenceVariableCharacteristicDefinitionByTypeAndValueComponent: Defines the characteristic using both a type and value[x] elements.
comment: EvidenceVariableCharacteristicComponent.EvidenceVariableCharacteristicDefinitionByTypeAndValueComponent: Defines the characteristic using both a type and value[x] elements.
subclass of: BackboneElement
subclass of: Restriction
  all values from: CodeableConcept
  on property: offset
subclass of: Restriction
  max cardinality: 1
  on property: device
subclass of: Restriction
  all values from: CodeableConcept
  on property: type
subclass of:
  union of: Restriction
    all values from: CodeableConcept
    on property: value
  union of: Restriction
    cardinality: 1
    on property: value
  union of: Restriction
    all values from: boolean
    on property: value
  union of: Restriction
    cardinality: 1
    on property: value
  union of: Restriction
    all values from: Quantity
    on property: value
  union of: Restriction
    cardinality: 1
    on property: value
  union of: Restriction
    all values from: Range
    on property: value
  union of: Restriction
    cardinality: 1
    on property: value
  union of: Restriction
    all values from: Reference
    on property: value
  union of: Restriction
    cardinality: 1
    on property: value
  union of: Restriction
    all values from: id
    on property: value
  union of: Restriction
    cardinality: 1
    on property: value
subclass of: Restriction
  all values from: CodeableConcept
  on property: method
subclass of: Restriction
  all values from: Reference
  on property: device
subclass of: Restriction
  cardinality: 1
  on property: type
subclass of: Restriction
  all values from: Reference
  on property: device
subclass of:
  union of: Restriction
    all values from: CodeableConcept
    on property: value
  union of: Restriction
    cardinality: 1
    on property: value
  union of: Restriction
    all values from: boolean
    on property: value
  union of: Restriction
    cardinality: 1
    on property: value
  union of: Restriction
    all values from: Quantity
    on property: value
  union of: Restriction
    cardinality: 1
    on property: value
  union of: Restriction
    all values from: Range
    on property: value
  union of: Restriction
    cardinality: 1
    on property: value
  union of: Restriction
    all values from: Reference
    on property: value
  union of: Restriction
    cardinality: 1
    on property: value
  union of: Restriction
    all values from: id
    on property: value
  union of: Restriction
    cardinality: 1
    on property: value
subclass of: Restriction
  max cardinality: 1
  on property: offset
subclass of: Restriction
  max cardinality: 1
  on property: offset
subclass of: Restriction
  all values from: CodeableConcept
  on property: type
subclass of: Restriction
  max cardinality: 1
  on property: device
subclass of: Restriction
  all values from: CodeableConcept
  on property: offset
subclass of: Restriction
  all values from: CodeableConcept
  on property: method
subclass of: Restriction
  cardinality: 1
  on property: type

operationalStatus
type: ObjectProperty
comment: Location.operationalStatus: The operational status covers operation values most relevant to beds (but can also apply to rooms/units/chairs/etc. such as an isolation unit/dialysis chair). This typically covers concepts such as contamination, housekeeping, and other activities like maintenance.
comment: DeviceMetric.operationalStatus: Indicates current operational state of the device. For example: On, Off, Standby, etc.
sub property of: status
modifierExtensionProperty: operationalStatus
title: Location.operationalStatus: The operational status of the location (typically only for a bed/room)
title: DeviceMetric.operationalStatus: on | off | standby | entered-in-error

_module
type: ObjectProperty
comment: (Modified) GuidanceResponse.module

MedicationAdministration
type: Class
comment: Describes the event of a patient consuming or otherwise being administered a medication. This may be as simple as swallowing a tablet or it may be a long running infusion. Related resources tie this event to the authorizing prescription, and the specific encounter between patient and health care practitioner. This event can also be used to record waste using a status of not-done and the appropriate statusReason.
subclass of: clinical.medication
subclass of: DomainResource
subclass of: Restriction
  all values from: MedicationAdministrationDosageComponent
  on property: dosage
subclass of: Restriction
  all values from: Reference
  on property: encounter
subclass of: Restriction
  all values from: CodeableConcept
  on property: category
subclass of: Restriction
  all values from: MedicationAdministrationPerformerComponent
  on property: performer
subclass of: Restriction
  all values from: Reference
  on property: basedOn
subclass of: Restriction
  cardinality: 1
  on property: status
subclass of: Restriction
  all values from: CodeableReference
  on property: medication
subclass of: Restriction
  all values from: Reference
  on property: partOf
subclass of: Restriction
  max cardinality: 1
  on property: request
subclass of: Restriction
  cardinality: 1
  on property: subject
subclass of: Restriction
  max cardinality: 1
  on property: dosage
subclass of: Restriction
  max cardinality: 1
  on property: recorded
subclass of: Restriction
  all values from: CodeableReference
  on property: device
subclass of: Restriction
  max cardinality: 1
  on property: encounter
subclass of: Restriction
  all values from: CodeableConcept
  on property: subPotentReason
subclass of:
  union of: Restriction
    all values from: dateTime
    on property: occurence
  union of: Restriction
    cardinality: 1
    on property: occurence
  union of: Restriction
    all values from: Period
    on property: occurence
  union of: Restriction
    cardinality: 1
    on property: occurence
  union of: Restriction
    all values from: Timing
    on property: occurence
  union of: Restriction
    cardinality: 1
    on property: occurence
subclass of: Restriction
  all values from: Identifier
  on property: identifier
subclass of: Restriction
  all values from: CodeableReference
  on property: reason
subclass of: Restriction
  all values from: code
  on property: status
subclass of: Restriction
  all values from: boolean
  on property: isSubPotent
subclass of: Restriction
  all values from: dateTime
  on property: recorded
subclass of: Restriction
  all values from: Reference
  on property: supportingInformation
subclass of: Restriction
  cardinality: 1
  on property: medication
subclass of: Restriction
  all values from: Reference
  on property: subject
subclass of: Restriction
  all values from: Annotation
  on property: note
subclass of: Restriction
  max cardinality: 1
  on property: isSubPotent
subclass of: Restriction
  all values from: CodeableConcept
  on property: statusReason
subclass of: Restriction
  all values from: Reference
  on property: request
subclass of: Restriction
  all values from: Reference
  on property: eventHistory
modifierExtensionClass: MedicationAdministration

UdiDeviceIdentifierMarketDistribution
type: Class
comment: DeviceDefinitionPackagingComponentPackagingUdiDeviceIdentifier.UdiDeviceIdentifierMarketDistribution: Indicates where and when the device is available on the market.
comment: DeviceDefinitionUdiDeviceIdentifierComponent.UdiDeviceIdentifierMarketDistribution: Indicates where and when the device is available on the market.
comment: DeviceDefinitionPackagingComponentUdiDeviceIdentifier.UdiDeviceIdentifierMarketDistribution: Indicates where and when the device is available on the market.
subclass of: BackboneElement
subclass of: Restriction
  all values from: uri
  on property: subJurisdiction
subclass of: Restriction
  all values from: Period
  on property: marketPeriod
subclass of: Restriction
  cardinality: 1
  on property: subJurisdiction
subclass of: Restriction
  cardinality: 1
  on property: subJurisdiction
subclass of: Restriction
  all values from: Period
  on property: marketPeriod
subclass of: Restriction
  all values from: Period
  on property: marketPeriod
subclass of: Restriction
  cardinality: 1
  on property: marketPeriod
subclass of: Restriction
  cardinality: 1
  on property: subJurisdiction
subclass of: Restriction
  all values from: uri
  on property: subJurisdiction
subclass of: Restriction
  cardinality: 1
  on property: marketPeriod
subclass of: Restriction
  all values from: uri
  on property: subJurisdiction
subclass of: Restriction
  cardinality: 1
  on property: marketPeriod

_probability
type: ObjectProperty
comment: (Modified) RiskAssessment.prediction.probability

clinicalRecommendationStatement
type: ObjectProperty
comment: Measure.clinicalRecommendationStatement: Provides a summary of relevant clinical guidelines or other clinical recommendations supporting the measure.
modifierExtensionProperty: _clinicalRecommendationStatement
title: Measure.clinicalRecommendationStatement: Summary of clinical guidelines

_image
type: ObjectProperty
comment: (Modified) ImplementationGuide.manifest.image
comment: (Modified) BodyStructure.image

SubscriptionTopicNotificationShapeComponent
type: Class
comment: SubscriptionTopicNotificationShapeComponent: List of properties to describe the shape (e.g., resources) included in notifications from this Subscription Topic.
subclass of: BackboneElement
subclass of: Restriction
  all values from: string
  on property: revInclude
subclass of: Restriction
  all values from: string
  on property: include
subclass of: Restriction
  cardinality: 1
  on property: resource
subclass of: Restriction
  all values from: uri
  on property: resource

_componentPart
type: ObjectProperty
comment: (Modified) PackagedProductDefinition.packaging.packaging.componentPart
comment: (Modified) PackagedProductDefinition.packaging.componentPart

op
type: ObjectProperty
comment: ValueSet.compose.exclude.filter.op: The kind of operation to perform as a part of the filter criteria.
comment: ValueSet.compose.include.filter.op: The kind of operation to perform as a part of the filter criteria.
comment: TerminologyCapabilities.codeSystem.version.filter.op: Operations supported for the property.
modifierExtensionProperty: op
title: ValueSet.compose.exclude.filter.op: = | is-a | descendent-of | is-not-a | regex | in | not-in | generalizes | child-of | descendent-leaf | exists
title: ValueSet.compose.include.filter.op: = | is-a | descendent-of | is-not-a | regex | in | not-in | generalizes | child-of | descendent-leaf | exists
title: TerminologyCapabilities.codeSystem.version.filter.op: Operations supported for the property

_processingFacility
type: ObjectProperty
comment: (Modified) BiologicallyDerivedProduct.processingFacility

unit
type: ObjectProperty
comment: Quantity.unit: A human-readable form of the unit.
comment: SubstancePolymer.repeat.repeatUnit.unit: Structural repeat units are essential elements for defining polymers.
comment: CoverageEligibilityResponse.insurance.item.unit: Indicates if the benefits apply to an individual or to the family.
comment: DeviceMetric.unit: Describes the unit that an observed value determined for this metric will have. For example: Percent, Seconds, etc.
comment: ExplanationOfBenefit.benefitBalance.unit: Indicates if the benefits apply to an individual or to the family.
comment: Coverage.costToBeneficiary.unit: Indicates if the benefits apply to an individual or to the family.
modifierExtensionProperty: _unit
title: SubstancePolymer.repeat.repeatUnit.unit: Structural repeat units are essential elements for defining polymers
title: Quantity.unit: Unit representation
title: CoverageEligibilityResponse.insurance.item.unit: Individual or family
title: DeviceMetric.unit: Unit of Measure for the Metric
title: ExplanationOfBenefit.benefitBalance.unit: Individual or family
title: Coverage.costToBeneficiary.unit: Individual or family

_problem
type: ObjectProperty
comment: (Modified) ClinicalImpression.problem

SubstanceDefinitionPropertyComponent
type: Class
comment: SubstanceDefinitionPropertyComponent: General specifications for this substance.
subclass of: BackboneElement
subclass of:
  union of: Restriction
    all values from: CodeableConcept
    on property: value
  union of: Restriction
    max cardinality: 1
    on property: value
  union of: Restriction
    all values from: Quantity
    on property: value
  union of: Restriction
    max cardinality: 1
    on property: value
  union of: Restriction
    all values from: date
    on property: value
  union of: Restriction
    max cardinality: 1
    on property: value
  union of: Restriction
    all values from: boolean
    on property: value
  union of: Restriction
    max cardinality: 1
    on property: value
  union of: Restriction
    all values from: Attachment
    on property: value
  union of: Restriction
    max cardinality: 1
    on property: value
subclass of: Restriction
  cardinality: 1
  on property: type
subclass of: Restriction
  all values from: CodeableConcept
  on property: type

_fluidConsistencyType
type: ObjectProperty
comment: (Modified) NutritionOrder.oralDiet.fluidConsistencyType

_SubstancePolymer
type: Class
comment: (Modified) SubstancePolymer
subclass of: DomainResource

ValueSetComposeIncludeConceptDesignationComponent
type: Class
comment: ValueSetComposeComponent.ConceptSet.ConceptReference.ValueSetComposeIncludeConceptDesignationComponent: Additional representations for this concept when used in this value set - other languages, aliases, specialized purposes, used for particular purposes, etc.
comment: ValueSetComposeComponentInclude.ConceptReference.ValueSetComposeIncludeConceptDesignationComponent: Additional representations for this concept when used in this value set - other languages, aliases, specialized purposes, used for particular purposes, etc.
subclass of: BackboneElement
subclass of: Restriction
  all values from: Coding
  on property: use
subclass of: Restriction
  all values from: Coding
  on property: use
subclass of: Restriction
  max cardinality: 1
  on property: use
subclass of: Restriction
  all values from: code
  on property: language
subclass of: Restriction
  all values from: string
  on property: value
subclass of: Restriction
  cardinality: 1
  on property: value
subclass of: Restriction
  all values from: Coding
  on property: additionalUse
subclass of: Restriction
  max cardinality: 1
  on property: language
subclass of: Restriction
  max cardinality: 1
  on property: language
subclass of: Restriction
  all values from: string
  on property: value
subclass of: Restriction
  all values from: code
  on property: language
subclass of: Restriction
  all values from: Coding
  on property: additionalUse
subclass of: Restriction
  max cardinality: 1
  on property: use
subclass of: Restriction
  cardinality: 1
  on property: value

versionReference
type: ObjectProperty
comment: ExampleScenario.process.step.alternative.step.process.step.operation.request.versionReference: A reference to the key of a specific version of an instance in this instance.
comment: ExampleScenario.process.step.alternative.step.operation.response.versionReference: A reference to the key of a specific version of an instance in this instance.
comment: ExampleScenario.process.step.operation.response.versionReference: A reference to the key of a specific version of an instance in this instance.
comment: ExampleScenario.instance.containedInstance.versionReference: A reference to the key of a specific version of an instance in this instance.
comment: ExampleScenario.process.step.alternative.step.process.step.operation.response.versionReference: A reference to the key of a specific version of an instance in this instance.
comment: ExampleScenario.process.step.process.step.alternative.step.operation.request.versionReference: A reference to the key of a specific version of an instance in this instance.
comment: ExampleScenario.process.step.process.step.operation.response.versionReference: A reference to the key of a specific version of an instance in this instance.
comment: ExampleScenario.process.step.alternative.step.operation.request.versionReference: A reference to the key of a specific version of an instance in this instance.
comment: ExampleScenario.process.step.process.step.operation.request.versionReference: A reference to the key of a specific version of an instance in this instance.
comment: ExampleScenario.process.step.process.step.alternative.step.operation.response.versionReference: A reference to the key of a specific version of an instance in this instance.
comment: ExampleScenario.process.step.operation.request.versionReference: A reference to the key of a specific version of an instance in this instance.
modifierExtensionProperty: versionReference
title: ExampleScenario.process.step.alternative.step.process.step.operation.response.versionReference: Key of contained instance version
title: ExampleScenario.process.step.process.step.alternative.step.operation.response.versionReference: Key of contained instance version
title: ExampleScenario.process.step.operation.response.versionReference: Key of contained instance version
title: ExampleScenario.process.step.process.step.operation.request.versionReference: Key of contained instance version
title: ExampleScenario.process.step.alternative.step.process.step.operation.request.versionReference: Key of contained instance version
title: ExampleScenario.instance.containedInstance.versionReference: Key of contained instance version
title: ExampleScenario.process.step.process.step.operation.response.versionReference: Key of contained instance version
title: ExampleScenario.process.step.operation.request.versionReference: Key of contained instance version
title: ExampleScenario.process.step.alternative.step.operation.request.versionReference: Key of contained instance version
title: ExampleScenario.process.step.process.step.alternative.step.operation.request.versionReference: Key of contained instance version
title: ExampleScenario.process.step.alternative.step.operation.response.versionReference: Key of contained instance version

_maxSingleDose
type: ObjectProperty
comment: (Modified) AdministrableProductDefinition.routeOfAdministration.maxSingleDose

meaning
type: ObjectProperty
comment: Permission.rule.data.resource.meaning: How the resource reference is interpreted when testing consent restrictions.
comment: Consent.provision.provision.data.meaning: How the resource reference is interpreted when testing consent restrictions.
comment: Consent.provision.data.meaning: How the resource reference is interpreted when testing consent restrictions.
modifierExtensionProperty: _meaning
title: Permission.rule.data.resource.meaning: instance | related | dependents | authoredby
title: Consent.provision.provision.data.meaning: instance | related | dependents | authoredby
title: Consent.provision.data.meaning: instance | related | dependents | authoredby

measurementPoint
type: ObjectProperty
comment: Ingredient.substance.strength.referenceStrength.measurementPoint: For when strength is measured at a particular point or distance.
comment: Ingredient.substance.strength.measurementPoint: For when strength is measured at a particular point or distance. There are products where strength is measured at a particular point. For example, the strength of the ingredient in some inhalers is measured at a particular position relative to the point of aerosolization.
modifierExtensionProperty: measurementPoint
title: Ingredient.substance.strength.referenceStrength.measurementPoint: When strength is measured at a particular point or distance
title: Ingredient.substance.strength.measurementPoint: When strength is measured at a particular point or distance

diagnosisRelatedGroup
type: ObjectProperty
comment: ExplanationOfBenefit.diagnosisRelatedGroup: A package billing code or bundle code used to group products and services to a particular health condition (such as heart attack) which is based on a predetermined grouping code system.
comment: ClaimResponse.diagnosisRelatedGroup: A package billing code or bundle code used to group products and services to a particular health condition (such as heart attack) which is based on a predetermined grouping code system.
comment: Claim.diagnosisRelatedGroup: A package billing code or bundle code used to group products and services to a particular health condition (such as heart attack) which is based on a predetermined grouping code system.
modifierExtensionProperty: diagnosisRelatedGroup
title: ExplanationOfBenefit.diagnosisRelatedGroup: Package billing code
title: ClaimResponse.diagnosisRelatedGroup: Package billing code
title: Claim.diagnosisRelatedGroup: Package billing code

_relative
type: ObjectProperty
comment: (Modified) MolecularSequence.relative

_publicationForm
type: ObjectProperty
comment: (Modified) Citation.citedArtifact.publicationForm

_Patient
type: Class
comment: (Modified) Patient
subclass of: DomainResource

GuidanceResponse
type: Class
comment: A guidance response is the formal response to a guidance request, including any output parameters returned by the evaluation, as well as the description of any proposed actions to be taken.
subclass of: DomainResource
subclass of: clinical.general
subclass of: Restriction
  all values from: Reference
  on property: outputParameters
subclass of: Restriction
  max cardinality: 1
  on property: requestIdentifier
subclass of: Restriction
  max cardinality: 1
  on property: occurrenceDateTime
subclass of: Restriction
  all values from: CodeableReference
  on property: reason
subclass of: Restriction
  all values from: Reference
  on property: result
subclass of: Restriction
  max cardinality: 1
  on property: evaluationMessage
subclass of: Restriction
  max cardinality: 1
  on property: encounter
subclass of: Restriction
  max cardinality: 1
  on property: subject
subclass of: Restriction
  all values from: Identifier
  on property: requestIdentifier
subclass of: Restriction
  all values from: Reference
  on property: performer
subclass of: Restriction
  all values from: code
  on property: status
subclass of: Restriction
  all values from: Reference
  on property: subject
subclass of: Restriction
  all values from: Reference
  on property: evaluationMessage
subclass of: Restriction
  all values from: Annotation
  on property: note
subclass of: Restriction
  all values from: DataRequirement
  on property: dataRequirement
subclass of: Restriction
  all values from: dateTime
  on property: occurrenceDateTime
subclass of: Restriction
  max cardinality: 1
  on property: outputParameters
subclass of: Restriction
  all values from: Reference
  on property: encounter
subclass of:
  union of: Restriction
    all values from: uri
    on property: module
  union of: Restriction
    cardinality: 1
    on property: module
  union of: Restriction
    all values from: canonical
    on property: module
  union of: Restriction
    cardinality: 1
    on property: module
  union of: Restriction
    all values from: CodeableConcept
    on property: module
  union of: Restriction
    cardinality: 1
    on property: module
subclass of: Restriction
  all values from: Identifier
  on property: identifier
subclass of: Restriction
  cardinality: 1
  on property: status
subclass of: Restriction
  max cardinality: 1
  on property: performer
modifierExtensionClass: GuidanceResponse

entity
type: ObjectProperty
comment: Contract.term.asset.valuedItem.entity
comment: Group.member.entity: A reference to the entity that is a member of the group. Must be consistent with Group.type. If the entity is another group, then the type must be the same.
comment: AuditEvent.entity: Specific instances of data or objects that have been accessed.
comment: Contract.term.group.asset.valuedItem.entity
comment: Provenance.entity: An entity used in this activity.
sub property of: what
modifierExtensionProperty: entity
title: AuditEvent.entity: Data or objects used
title: Group.member.entity: Reference to the group member
title: Provenance.entity: An entity used in this activity

sourceReference
type: ObjectProperty
comment: Consent.sourceReference: A reference to a consent that links back to such a source, a reference to a document repository (e.g. XDS) that stores the original consent document.
modifierExtensionProperty: sourceReference
title: Consent.sourceReference: Source from which this consent is taken

valueFilter
type: ObjectProperty
comment: DataRequirement.valueFilter: Value filters specify additional constraints on the data for elements other than code-valued or date-valued. Each value filter specifies an additional constraint on the data (i.e. valueFilters are AND'ed, not OR'ed).
modifierExtensionProperty: valueFilter
title: DataRequirement.valueFilter: What values are expected

_useBy
type: ObjectProperty
comment: (Modified) NutritionProduct.instance.useBy

bodyLandmarkOrientation
type: ObjectProperty
comment: BodyStructure.excludedStructure.bodyLandmarkOrientation: Body locations in relation to a specific body landmark (tatoo, scar, other body structure).
comment: BodyStructure.includedStructure.bodyLandmarkOrientation: Body locations in relation to a specific body landmark (tatoo, scar, other body structure).
modifierExtensionProperty: _bodyLandmarkOrientation
title: BodyStructure.excludedStructure.bodyLandmarkOrientation: Landmark relative location
title: BodyStructure.includedStructure.bodyLandmarkOrientation: Landmark relative location

SubstanceDefinitionNameComponentName
type: Class
comment: A synonym of this particular name, by which the substance is also known.
comment: A translation for this name into another human language.
subclass of: BackboneElement
subclass of: Restriction
  max cardinality: 1
  on property: status
subclass of: Restriction
  all values from: string
  on property: name
subclass of: Restriction
  all values from: boolean
  on property: preferred
subclass of: Restriction
  all values from: Reference
  on property: source
subclass of: Restriction
  all values from: SubstanceDefinitionNameComponentNameName
  on property: translation
subclass of: Restriction
  all values from: Reference
  on property: source
subclass of: Restriction
  max cardinality: 1
  on property: preferred
subclass of: Restriction
  max cardinality: 1
  on property: type
subclass of: Restriction
  cardinality: 1
  on property: name
subclass of: Restriction
  all values from: CodeableConcept
  on property: status
subclass of: Restriction
  all values from: CodeableConcept
  on property: type
subclass of: Restriction
  all values from: CodeableConcept
  on property: domain
subclass of: Restriction
  all values from: SubstanceDefinitionNameComponentNameName
  on property: synonym
subclass of: Restriction
  max cardinality: 1
  on property: type
subclass of: Restriction
  all values from: string
  on property: name
subclass of: Restriction
  all values from: CodeableConcept
  on property: domain
subclass of: Restriction
  max cardinality: 1
  on property: status
subclass of: Restriction
  all values from: CodeableConcept
  on property: jurisdiction
subclass of: Restriction
  all values from: boolean
  on property: preferred
subclass of: Restriction
  all values from: CodeableConcept
  on property: language
subclass of: Restriction
  all values from: CodeableConcept
  on property: jurisdiction
subclass of: Restriction
  all values from: SubstanceDefinitionNameComponentNameName
  on property: translation
subclass of: Restriction
  all values from: CodeableConcept
  on property: type
subclass of: Restriction
  all values from: SubstanceDefinitionNameComponentNameName
  on property: synonym
subclass of: Restriction
  all values from: SubstanceDefinitionNameOfficialComponent
  on property: official
subclass of: Restriction
  all values from: SubstanceDefinitionNameOfficialComponent
  on property: official
subclass of: Restriction
  cardinality: 1
  on property: name
subclass of: Restriction
  all values from: CodeableConcept
  on property: status
subclass of: Restriction
  max cardinality: 1
  on property: preferred
subclass of: Restriction
  all values from: CodeableConcept
  on property: language
title: A translation for this name into another human language
title: A synonym of this particular name, by which the substance is also known

_policyText
type: ObjectProperty
comment: (Modified) Consent.policyText

_changePattern
type: ObjectProperty
comment: (Modified) ClinicalImpression.changePattern

subDetail
type: ObjectProperty
comment: ExplanationOfBenefit.item.detail.subDetail: Third-tier of goods and services.
comment: ExplanationOfBenefit.addItem.detail.subDetail: The third-tier service adjudications for payor added services.
comment: ClaimResponse.item.detail.subDetail: A sub-detail adjudication of a simple product or service.
comment: ClaimResponse.addItem.detail.subDetail: The third-tier service adjudications for payor added services.
comment: Claim.item.detail.subDetail: A claim detail line. Either a simple (a product or service) or a 'group' of sub-details which are simple items.
modifierExtensionProperty: _subDetail
title: ClaimResponse.item.detail.subDetail: Adjudication for claim sub-details
title: ExplanationOfBenefit.addItem.detail.subDetail: Insurer added line items
title: Claim.item.detail.subDetail: Product or service provided
title: ClaimResponse.addItem.detail.subDetail: Insurer added line items
title: ExplanationOfBenefit.item.detail.subDetail: Additional items

allDay
type: ObjectProperty
comment: Availability.availableTime.allDay: Always available? i.e. 24 hour service.
modifierExtensionProperty: allDay
title: Availability.availableTime.allDay: Always available? i.e. 24 hour service

_modification
type: ObjectProperty
comment: (Modified) SubstancePolymer.modification

_nodeId
type: ObjectProperty
comment: (Modified) GraphDefinition.node.nodeId

AdverseEventContributingFactorComponent
type: Class
comment: AdverseEventContributingFactorComponent: The contributing factors suspected to have increased the probability or severity of the adverse event.
subclass of: BackboneElement
subclass of:
  union of: Restriction
    all values from: Reference
    on property: item
  union of: Restriction
    cardinality: 1
    on property: item
  union of: Restriction
    all values from: CodeableConcept
    on property: item
  union of: Restriction
    cardinality: 1
    on property: item

TestPlanTestCaseComponent
type: Class
comment: TestPlanTestCaseComponent: The individual test cases that are part of this plan, when they they are made explicit.
subclass of: BackboneElement
subclass of: Restriction
  all values from: integer
  on property: sequence
subclass of: Restriction
  all values from: Reference
  on property: scope
subclass of: Restriction
  all values from: TestPlanTestCaseTestRunComponent
  on property: testRun
subclass of: Restriction
  all values from: TestCaseDependency
  on property: dependency
subclass of: Restriction
  all values from: TestPlanTestCaseAssertionComponent
  on property: assertion
subclass of: Restriction
  all values from: TestPlanTestCaseTestDataComponent
  on property: testData
subclass of: Restriction
  max cardinality: 1
  on property: sequence

sunday
type: ObjectProperty
comment: Appointment.recurrenceTemplate.weeklyTemplate.sunday: Indicates that recurring appointments should occur on Sundays.
modifierExtensionProperty: sunday
title: Appointment.recurrenceTemplate.weeklyTemplate.sunday: Recurs on Sunday

cancellationReason
type: ObjectProperty
comment: Appointment.cancellationReason: The coded reason for the appointment being cancelled. This is often used in reporting/billing/futher processing to determine if further actions are required, or specific fees apply.
modifierExtensionProperty: cancellationReason
title: Appointment.cancellationReason: The coded reason for the appointment being cancelled

_title
type: ObjectProperty
comment: (Modified) ExampleScenario.process.step.process.step.alternative.step.operation.title
comment: (Modified) GenomicStudy.analysis.title
comment: (Modified) ExampleScenario.process.step.process.step.alternative.title
comment: (Modified) ActivityDefinition.title
comment: (Modified) ResearchStudy.title
comment: (Modified) PlanDefinition.title
comment: (Modified) ExampleScenario.process.step.alternative.step.alternative.title
comment: (Modified) SearchParameter.title
comment: (Modified) ExampleScenario.instance.title
comment: (Modified) ExampleScenario.title
comment: (Modified) MessageDefinition.title
comment: (Modified) EvidenceReport.section.title
comment: (Modified) ConceptMap.title
comment: (Modified) ValueSet.title
comment: (Modified) ExampleScenario.process.step.operation.title
comment: (Modified) ExampleScenario.process.step.alternative.title
comment: (Modified) Questionnaire.title
comment: (Modified) ChargeItemDefinition.title
comment: (Modified) Citation.title
comment: (Modified) SubscriptionTopic.title
comment: (Modified) Measure.title
comment: (Modified) CapabilityStatement.title
comment: (Modified) PlanDefinition.action.action.title
comment: (Modified) Evidence.title
comment: (Modified) ConditionDefinition.title
comment: (Modified) ImplementationGuide.definition.page.title
comment: (Modified) CodeSystem.title
comment: (Modified) RequestOrchestration.action.input.title
comment: (Modified) Citation.citedArtifact.title
comment: (Modified) ExampleScenario.process.step.alternative.step.process.title
comment: (Modified) SpecimenDefinition.title
comment: (Modified) Library.title
comment: (Modified) ImplementationGuide.manifest.page.title
comment: (Modified) Citation.citedArtifact.publicationForm.publishedIn.title
comment: (Modified) ActorDefinition.title
comment: (Modified) EventDefinition.title
comment: (Modified) NamingSystem.title
comment: (Modified) RequestOrchestration.action.title
comment: (Modified) OperationDefinition.title
comment: (Modified) ImplementationGuide.title
comment: (Modified) ObservationDefinition.title
comment: (Modified) ExampleScenario.process.step.alternative.step.process.step.operation.title
comment: (Modified) ExampleScenario.process.title
comment: (Modified) GraphDefinition.title
comment: (Modified) RequestOrchestration.action.output.title
comment: (Modified) ImagingStudy.series.instance.title
comment: (Modified) ExampleScenario.process.step.process.step.operation.title
comment: (Modified) Composition.section.section.title
comment: (Modified) Composition.section.title
comment: (Modified) Composition.title
comment: (Modified) ExampleScenario.process.step.process.title
comment: (Modified) Attachment.title
comment: (Modified) StructureDefinition.title
comment: (Modified) RequestOrchestration.action.action.title
comment: (Modified) Requirements.title
comment: (Modified) TestScript.title
comment: (Modified) RequestOrchestration.action.action.input.title
comment: (Modified) List.title
comment: (Modified) ExampleScenario.actor.title
comment: (Modified) ExampleScenario.instance.version.title
comment: (Modified) StructureMap.title
comment: (Modified) PlanDefinition.action.action.input.title
comment: (Modified) PlanDefinition.action.action.output.title
comment: (Modified) EvidenceReport.section.section.title
comment: (Modified) ImplementationGuide.definition.page.page.title
comment: (Modified) TerminologyCapabilities.title
comment: (Modified) ExampleScenario.process.step.alternative.step.operation.title
comment: (Modified) PlanDefinition.action.input.title
comment: (Modified) ArtifactAssessment.title
comment: (Modified) PlanDefinition.action.title
comment: (Modified) RequestOrchestration.action.action.output.title
comment: (Modified) CarePlan.title
comment: (Modified) PlanDefinition.action.output.title
comment: (Modified) PlanDefinition.actor.title
comment: (Modified) ExampleScenario.process.step.alternative.step.process.step.alternative.title
comment: (Modified) EvidenceVariable.title
comment: (Modified) ExampleScenario.process.step.process.step.alternative.step.alternative.title
comment: (Modified) CanonicalResource.title
comment: (Modified) CompartmentDefinition.title

_sourceId
type: ObjectProperty
comment: (Modified) OperationDefinition.parameter.referencedFrom.sourceId
comment: (Modified) TestScript.variable.sourceId
comment: (Modified) TestScript.setup.action.operation.sourceId
comment: (Modified) TestScript.setup.action.assert.sourceId
comment: (Modified) TestScript.teardown.action.operation.sourceId
comment: (Modified) TestScript.test.action.operation.sourceId
comment: (Modified) OperationDefinition.parameter.part.referencedFrom.sourceId
comment: (Modified) TestScript.test.action.assert.sourceId
comment: (Modified) GraphDefinition.link.sourceId

_entityRelatedness
type: ObjectProperty
comment: (Modified) AdverseEvent.suspectEntity.causality.entityRelatedness

line
type: ObjectProperty
comment: Address.line: This component contains the house number, apartment number, street name, street direction, P.O. Box number, delivery hints, and similar address information.
modifierExtensionProperty: line
title: Address.line: Street name, number, direction & P.O. Box etc.

_effectivePeriod
type: ObjectProperty
comment: (Modified) PlanDefinition.effectivePeriod
comment: (Modified) Library.effectivePeriod
comment: (Modified) ChargeItemDefinition.propertyGroup.applicability.effectivePeriod
comment: (Modified) ActivityDefinition.effectivePeriod
comment: (Modified) ObservationDefinition.effectivePeriod
comment: (Modified) EvidenceVariable.effectivePeriod
comment: (Modified) EventDefinition.effectivePeriod
comment: (Modified) ValueSet.effectivePeriod
comment: (Modified) CodeSystem.effectivePeriod
comment: (Modified) MetadataResource.effectivePeriod
comment: (Modified) ChargeItemDefinition.applicability.effectivePeriod
comment: (Modified) Questionnaire.effectivePeriod
comment: (Modified) DeviceDefinition.chargeItem.effectivePeriod
comment: (Modified) NamingSystem.effectivePeriod
comment: (Modified) SubscriptionTopic.effectivePeriod
comment: (Modified) ConceptMap.effectivePeriod
comment: (Modified) Citation.effectivePeriod
comment: (Modified) SpecimenDefinition.effectivePeriod
comment: (Modified) Measure.effectivePeriod

preAuthRef
type: ObjectProperty
comment: ClaimResponse.preAuthRef: Reference from the Insurer which is used in later communications which refers to this adjudication.
comment: ExplanationOfBenefit.item.detail.reviewOutcome.preAuthRef: Reference from the Insurer which is used in later communications which refers to this adjudication.
comment: ClaimResponse.addItem.reviewOutcome.preAuthRef: Reference from the Insurer which is used in later communications which refers to this adjudication.
comment: ClaimResponse.item.reviewOutcome.preAuthRef: Reference from the Insurer which is used in later communications which refers to this adjudication.
comment: ClaimResponse.item.detail.reviewOutcome.preAuthRef: Reference from the Insurer which is used in later communications which refers to this adjudication.
comment: ExplanationOfBenefit.item.detail.subDetail.reviewOutcome.preAuthRef: Reference from the Insurer which is used in later communications which refers to this adjudication.
comment: ClaimResponse.item.detail.subDetail.reviewOutcome.preAuthRef: Reference from the Insurer which is used in later communications which refers to this adjudication.
comment: ClaimResponse.addItem.detail.reviewOutcome.preAuthRef: Reference from the Insurer which is used in later communications which refers to this adjudication.
comment: ExplanationOfBenefit.preAuthRef: Reference from the Insurer which is used in later communications which refers to this adjudication.
comment: ClaimResponse.addItem.detail.subDetail.reviewOutcome.preAuthRef: Reference from the Insurer which is used in later communications which refers to this adjudication.
comment: ExplanationOfBenefit.addItem.detail.subDetail.reviewOutcome.preAuthRef: Reference from the Insurer which is used in later communications which refers to this adjudication.
comment: ExplanationOfBenefit.insurance.preAuthRef: Reference numbers previously provided by the insurer to the provider to be quoted on subsequent claims containing services or products related to the prior authorization.
comment: CoverageEligibilityResponse.preAuthRef: A reference from the Insurer to which these services pertain to be used on further communication and as proof that the request occurred.
comment: ExplanationOfBenefit.item.reviewOutcome.preAuthRef: Reference from the Insurer which is used in later communications which refers to this adjudication.
comment: ExplanationOfBenefit.addItem.detail.reviewOutcome.preAuthRef: Reference from the Insurer which is used in later communications which refers to this adjudication.
comment: ExplanationOfBenefit.addItem.reviewOutcome.preAuthRef: Reference from the Insurer which is used in later communications which refers to this adjudication.
comment: Claim.insurance.preAuthRef: Reference numbers previously provided by the insurer to the provider to be quoted on subsequent claims containing services or products related to the prior authorization.
modifierExtensionProperty: preAuthRef
title: ExplanationOfBenefit.preAuthRef: Preauthorization reference
title: Claim.insurance.preAuthRef: Prior authorization reference number
title: ClaimResponse.item.detail.subDetail.reviewOutcome.preAuthRef: Preauthorization reference
title: ClaimResponse.item.reviewOutcome.preAuthRef: Preauthorization reference
title: ExplanationOfBenefit.addItem.detail.reviewOutcome.preAuthRef: Preauthorization reference
title: ClaimResponse.preAuthRef: Preauthorization reference
title: CoverageEligibilityResponse.preAuthRef: Preauthorization reference
title: ExplanationOfBenefit.addItem.detail.subDetail.reviewOutcome.preAuthRef: Preauthorization reference
title: ExplanationOfBenefit.item.detail.reviewOutcome.preAuthRef: Preauthorization reference
title: ClaimResponse.addItem.detail.reviewOutcome.preAuthRef: Preauthorization reference
title: ClaimResponse.addItem.reviewOutcome.preAuthRef: Preauthorization reference
title: ClaimResponse.item.detail.reviewOutcome.preAuthRef: Preauthorization reference
title: ExplanationOfBenefit.addItem.reviewOutcome.preAuthRef: Preauthorization reference
title: ExplanationOfBenefit.item.detail.subDetail.reviewOutcome.preAuthRef: Preauthorization reference
title: ExplanationOfBenefit.item.reviewOutcome.preAuthRef: Preauthorization reference
title: ExplanationOfBenefit.insurance.preAuthRef: Prior authorization reference number
title: ClaimResponse.addItem.detail.subDetail.reviewOutcome.preAuthRef: Preauthorization reference

requestId
type: ObjectProperty
comment: TestScript.teardown.action.operation.requestId: The fixture id (maybe new) to map to the request.
comment: TestScript.test.action.operation.requestId: The fixture id (maybe new) to map to the request.
comment: TestScript.setup.action.operation.requestId: The fixture id (maybe new) to map to the request.
modifierExtensionProperty: requestId
title: TestScript.teardown.action.operation.requestId: Fixture Id of mapped request
title: TestScript.test.action.operation.requestId: Fixture Id of mapped request
title: TestScript.setup.action.operation.requestId: Fixture Id of mapped request

_autodelete
type: ObjectProperty
comment: (Modified) TestScript.fixture.autodelete

_fundsReserve
type: ObjectProperty
comment: (Modified) ExplanationOfBenefit.fundsReserve
comment: (Modified) ClaimResponse.fundsReserve
comment: (Modified) Claim.fundsReserve

BundleEntryComponentLink
type: Class
comment: A series of links that provide context to this entry.
subclass of: BackboneElement
subclass of: Restriction
  cardinality: 1
  on property: url
subclass of: Restriction
  all values from: uri
  on property: url
subclass of: Restriction
  cardinality: 1
  on property: relation
subclass of: Restriction
  all values from: code
  on property: relation
title: Links related to this entry

DocumentReferenceContentComponent
type: Class
comment: DocumentReferenceContentComponent: The document and format referenced. If there are multiple content element repetitions, these must all represent the same document in different format, or attachment metadata.
subclass of: BackboneElement
subclass of: Restriction
  all values from: DocumentReferenceContentProfileComponent
  on property: profile
subclass of: Restriction
  cardinality: 1
  on property: attachment
subclass of: Restriction
  all values from: Attachment
  on property: attachment

_holder
type: ObjectProperty
comment: (Modified) RegulatedAuthorization.holder

_qualifiers
type: ObjectProperty
comment: (Modified) InsurancePlan.plan.specificCost.benefit.cost.qualifiers

_Specimen
type: Class
comment: (Modified) Specimen
subclass of: DomainResource

CodeSystemFilterComponent
type: Class
comment: CodeSystemFilterComponent: A filter that can be used in a value set compose statement when selecting concepts using a filter.
subclass of: BackboneElement
subclass of: Restriction
  all values from: string
  on property: value
subclass of: Restriction
  max cardinality: 1
  on property: description
subclass of: Restriction
  min cardinality: 1
  on property: operator
subclass of: Restriction
  all values from: string
  on property: description
subclass of: Restriction
  all values from: code
  on property: code
subclass of: Restriction
  cardinality: 1
  on property: value
subclass of: Restriction
  cardinality: 1
  on property: code
subclass of: Restriction
  all values from: code
  on property: operator

_replacementSequence
type: ObjectProperty
comment: (Modified) MolecularSequence.relative.edit.replacementSequence

serviceCategory
type: ObjectProperty
comment: Slot.serviceCategory: A broad categorization of the service that is to be performed during this appointment.
comment: Appointment.serviceCategory: A broad categorization of the service that is to be performed during this appointment.
comment: Schedule.serviceCategory: A broad categorization of the service that is to be performed during this appointment.
sub property of: class
modifierExtensionProperty: serviceCategory
title: Slot.serviceCategory: A broad categorization of the service that is to be performed during this appointment
title: Appointment.serviceCategory: A broad categorization of the service that is to be performed during this appointment
title: Schedule.serviceCategory: High-level category

_next
type: ObjectProperty
comment: (Modified) ValueSet.expansion.next

paymentTerms
type: ObjectProperty
comment: Invoice.paymentTerms: Payment details such as banking details, period of payment, deductibles, methods of payment.
modifierExtensionProperty: paymentTerms
title: Invoice.paymentTerms: Payment details

_started
type: ObjectProperty
comment: (Modified) ImagingStudy.series.started
comment: (Modified) ImagingStudy.started

offer
type: ObjectProperty
comment: Contract.term.group.offer: The matter of concern in the context of this provision of the agrement.
comment: Contract.term.offer: The matter of concern in the context of this provision of the agrement.
modifierExtensionProperty: offer
title: Contract.term.group.offer: Context of the Contract term
title: Contract.term.offer: Context of the Contract term

coordinateSystem
type: ObjectProperty
comment: MolecularSequence.relative.coordinateSystem: These are different ways of identifying nucleotides or amino acids within a sequence. Different databases and file types may use different systems. For detail definitions, see https://loinc.org/92822-6/ for more detail.
modifierExtensionProperty: coordinateSystem
title: MolecularSequence.relative.coordinateSystem: Ways of identifying nucleotides or amino acids within a sequence

DeviceDefinition
type: Class
comment: This is a specialized resource that defines the characteristics and capabilities of a device.
subclass of: DomainResource
subclass of: administrative.device
subclass of: Restriction
  all values from: Identifier
  on property: identifier
subclass of: Restriction
  all values from: Reference
  on property: manufacturer
subclass of: Restriction
  all values from: DeviceDefinitionRegulatoryIdentifierComponent
  on property: regulatoryIdentifier
subclass of: Restriction
  max cardinality: 1
  on property: partNumber
subclass of: Restriction
  all values from: DeviceDefinitionGuidelineComponent
  on property: guideline
subclass of: Restriction
  all values from: DeviceDefinitionMaterialComponent
  on property: material
subclass of: Restriction
  max cardinality: 1
  on property: owner
subclass of: Restriction
  max cardinality: 1
  on property: manufacturer
subclass of: Restriction
  all values from: DeviceDefinitionUdiDeviceIdentifierComponent
  on property: udiDeviceIdentifier
subclass of: Restriction
  all values from: ProductShelfLife
  on property: shelfLifeStorage
subclass of: Restriction
  max cardinality: 1
  on property: correctiveAction
subclass of: Restriction
  all values from: string
  on property: partNumber
subclass of: Restriction
  all values from: DeviceDefinitionChargeItemComponent
  on property: chargeItem
subclass of: Restriction
  all values from: DeviceDefinitionPropertyComponent
  on property: property
subclass of: Restriction
  max cardinality: 1
  on property: description
subclass of: Restriction
  all values from: CodeableConcept
  on property: safety
subclass of: Restriction
  all values from: ContactPoint
  on property: contact
subclass of: Restriction
  all values from: DeviceDefinitionDeviceNameComponent
  on property: deviceName
subclass of: Restriction
  all values from: DeviceDefinitionLinkComponent
  on property: link
subclass of: Restriction
  all values from: DeviceDefinitionClassificationComponent
  on property: classification
subclass of: Restriction
  max cardinality: 1
  on property: modelNumber
subclass of: Restriction
  all values from: DeviceDefinitionHasPartComponent
  on property: hasPart
subclass of: Restriction
  all values from: DeviceDefinitionCorrectiveActionComponent
  on property: correctiveAction
subclass of: Restriction
  all values from: DeviceDefinitionVersionComponent
  on property: version
subclass of: Restriction
  all values from: Annotation
  on property: note
subclass of: Restriction
  all values from: markdown
  on property: description
subclass of: Restriction
  all values from: string
  on property: modelNumber
subclass of: Restriction
  all values from: CodeableConcept
  on property: languageCode
subclass of: Restriction
  all values from: code
  on property: productionIdentifierInUDI
subclass of: Restriction
  all values from: Reference
  on property: owner
subclass of: Restriction
  all values from: DeviceDefinitionPackagingComponent
  on property: packaging
subclass of: Restriction
  max cardinality: 1
  on property: guideline
subclass of: Restriction
  all values from: DeviceDefinitionConformsToComponent
  on property: conformsTo
modifierExtensionClass: DeviceDefinition

_intent
type: ObjectProperty
comment: (Modified) RequestOrchestration.intent
comment: (Modified) CommunicationRequest.intent
comment: (Modified) CarePlan.intent
comment: (Modified) NutritionOrder.intent
comment: (Modified) ServiceRequest.intent
comment: (Modified) Contract.term.action.intent
comment: (Modified) ActivityDefinition.intent
comment: (Modified) Transport.intent
comment: (Modified) Task.intent
comment: (Modified) MedicationRequest.intent
comment: (Modified) DeviceRequest.intent
comment: (Modified) Contract.term.group.action.intent

_text
type: ObjectProperty
comment: (Modified) QuestionnaireResponse.item.item.text
comment: (Modified) QuestionnaireResponse.item.answer.item.text
comment: (Modified) Contract.term.group.asset.text
comment: (Modified) ClaimResponse.processNote.text
comment: (Modified) Composition.section.text
comment: (Modified) CodeableConcept.text
comment: (Modified) MedicationAdministration.dosage.text
comment: (Modified) Contract.term.group.asset.context.text
comment: (Modified) PaymentReconciliation.processNote.text
comment: (Modified) QuestionnaireResponse.item.text
comment: (Modified) Citation.citedArtifact.abstract.text
comment: (Modified) Dosage.text
comment: (Modified) DomainResource.text
comment: (Modified) Contract.term.group.offer.text
comment: (Modified) Annotation.text
comment: (Modified) Observation.component.referenceRange.text
comment: (Modified) Contract.term.text
comment: (Modified) Contract.term.group.text
comment: (Modified) EvidenceReport.section.text
comment: (Modified) Citation.citedArtifact.title.text
comment: (Modified) ExplanationOfBenefit.processNote.text
comment: (Modified) Citation.summary.text
comment: (Modified) Observation.referenceRange.text
comment: (Modified) Address.text
comment: (Modified) Questionnaire.item.item.text
comment: (Modified) Contract.term.asset.context.text
comment: (Modified) Contract.term.asset.text
comment: (Modified) Questionnaire.item.text
comment: (Modified) HumanName.text
comment: (Modified) Composition.section.section.text
comment: (Modified) EvidenceReport.section.section.text
comment: (Modified) Contract.term.offer.text

_level
type: ObjectProperty
comment: (Modified) Evidence.statistic.modelCharacteristic.attributeEstimate.level
comment: (Modified) Evidence.statistic.attributeEstimate.attributeEstimate.level
comment: (Modified) Evidence.statistic.attributeEstimate.level

facility
type: ObjectProperty
comment: CoverageEligibilityRequest.item.facility: Facility where the services will be provided.
comment: ExplanationOfBenefit.facility: Facility where the services were provided.
comment: Claim.facility: Facility where the services were provided.
comment: CoverageEligibilityRequest.facility: Facility where the services are intended to be provided.
sub property of: where
modifierExtensionProperty: facility
title: CoverageEligibilityRequest.facility: Servicing facility
title: Claim.facility: Servicing facility
title: ExplanationOfBenefit.facility: Servicing Facility
title: CoverageEligibilityRequest.item.facility: Servicing facility

qualifiedValue
type: ObjectProperty
comment: ObservationDefinition.component.qualifiedValue: A set of qualified values associated with a context and a set of conditions - provides a range for quantitative and ordinal observations and a collection of value sets for qualitative observations.
comment: ObservationDefinition.qualifiedValue: A set of qualified values associated with a context and a set of conditions - provides a range for quantitative and ordinal observations and a collection of value sets for qualitative observations.
modifierExtensionProperty: _qualifiedValue
title: ObservationDefinition.component.qualifiedValue: Set of qualified values for observation results
title: ObservationDefinition.qualifiedValue: Set of qualified values for observation results

ManifestResource
type: Class
comment: ImplementationGuideManifestComponent.ManifestResource: A resource that is part of the implementation guide. Conformance resources (value set, structure definition, capability statements etc.) are obvious candidates for inclusion, but any kind of resource can be included as an example resource.
subclass of: BackboneElement
subclass of: Restriction
  all values from: canonical
  on property: profile
subclass of: Restriction
  all values from: boolean
  on property: isExample
subclass of: Restriction
  all values from: Reference
  on property: reference
subclass of: Restriction
  all values from: url
  on property: relativePath
subclass of: Restriction
  max cardinality: 1
  on property: isExample
subclass of: Restriction
  max cardinality: 1
  on property: relativePath
subclass of: Restriction
  cardinality: 1
  on property: reference

prism
type: ObjectProperty
comment: VisionPrescription.lensSpecification.prism: Allows for adjustment on two axis.
modifierExtensionProperty: prism
title: VisionPrescription.lensSpecification.prism: Eye alignment compensation

MedicationBatchComponent
type: Class
comment: MedicationBatchComponent: Information that only applies to packages (not products).
subclass of: BackboneElement
subclass of: Restriction
  max cardinality: 1
  on property: expirationDate
subclass of: Restriction
  all values from: dateTime
  on property: expirationDate
subclass of: Restriction
  max cardinality: 1
  on property: lotNumber
subclass of: Restriction
  all values from: string
  on property: lotNumber

resultForDelete
type: ObjectProperty
comment: SubscriptionTopic.resourceTrigger.queryCriteria.resultForDelete: For 'delete' interactions, should the 'current' query criteria count as an automatic pass or an automatic fail. If not present, the testing behavior during `delete` interactions is unspecified (server discretion).
modifierExtensionProperty: resultForDelete
title: SubscriptionTopic.resourceTrigger.queryCriteria.resultForDelete: test-passes | test-fails

_accept
type: ObjectProperty
comment: (Modified) TestScript.teardown.action.operation.accept
comment: (Modified) TestScript.test.action.operation.accept
comment: (Modified) TestScript.setup.action.operation.accept

overbooked
type: ObjectProperty
comment: Slot.overbooked: This slot has already been overbooked, appointments are unlikely to be accepted for this time.
modifierExtensionProperty: overbooked
title: Slot.overbooked: This slot has already been overbooked, appointments are unlikely to be accepted for this time

_plan
type: ObjectProperty
comment: (Modified) InsurancePlan.plan
comment: (Modified) ConditionDefinition.plan

ReviewOutcome
type: Class
comment: ClaimResponse.Item.ReviewOutcome: The high-level results of the adjudication if adjudication has been performed.
subclass of: BackboneElement
subclass of: Restriction
  all values from: Period
  on property: preAuthPeriod
subclass of: Restriction
  all values from: CodeableConcept
  on property: reason
subclass of: Restriction
  all values from: string
  on property: preAuthRef
subclass of: Restriction
  max cardinality: 1
  on property: preAuthPeriod
subclass of: Restriction
  all values from: CodeableConcept
  on property: decision
subclass of: Restriction
  max cardinality: 1
  on property: decision
subclass of: Restriction
  max cardinality: 1
  on property: preAuthRef

CitationCitedArtifactContributorshipEntryComponent
type: Class
comment: CitationCitedArtifactComponent.CitationCitedArtifactContributorshipComponent.CitationCitedArtifactContributorshipEntryComponent: An individual entity named as a contributor, for example in the author list or contributor list.
subclass of: BackboneElement
subclass of: Restriction
  all values from: CitationCitedArtifactContributorshipEntryContributionInstanceComponent
  on property: contributionInstance
subclass of: Restriction
  max cardinality: 1
  on property: rankingOrder
subclass of: Restriction
  all values from: string
  on property: forenameInitials
subclass of: Restriction
  all values from: Reference
  on property: contributor
subclass of: Restriction
  all values from: CodeableConcept
  on property: role
subclass of: Restriction
  all values from: Reference
  on property: affiliation
subclass of: Restriction
  all values from: CodeableConcept
  on property: contributionType
subclass of: Restriction
  max cardinality: 1
  on property: correspondingContact
subclass of: Restriction
  max cardinality: 1
  on property: forenameInitials
subclass of: Restriction
  cardinality: 1
  on property: contributor
subclass of: Restriction
  max cardinality: 1
  on property: role
subclass of: Restriction
  all values from: positiveInt
  on property: rankingOrder
subclass of: Restriction
  all values from: boolean
  on property: correspondingContact

discriminator
type: ObjectProperty
comment: ElementDefinition.slicing.discriminator: Designates which child elements are used to discriminate between the slices when processing an instance. If one or more discriminators are provided, the value of the child elements in the instance data SHALL completely distinguish which slice the element in the resource matches based on the allowed values for those elements in each of the slices.
modifierExtensionProperty: _discriminator
title: ElementDefinition.slicing.discriminator: Element values that are used to distinguish the slices

ordered
type: ObjectProperty
comment: ElementDefinition.slicing.ordered: If the matching elements have to occur in the same order as defined in the profile.
modifierExtensionProperty: _ordered
title: ElementDefinition.slicing.ordered: If elements must be in same order as slices

LegalLanguage
type: Class
comment: Contract.LegalLanguage: List of Legal expressions or representations of this Contract.
subclass of: BackboneElement
subclass of:
  union of: Restriction
    all values from: Attachment
    on property: content
  union of: Restriction
    cardinality: 1
    on property: content
  union of: Restriction
    all values from: Reference
    on property: content
  union of: Restriction
    cardinality: 1
    on property: content

frequencyOfOccurrence
type: ObjectProperty
comment: ClinicalUseDefinition.undesirableEffect.frequencyOfOccurrence: How often the effect is seen.
modifierExtensionProperty: _frequencyOfOccurrence
title: ClinicalUseDefinition.undesirableEffect.frequencyOfOccurrence: How often the effect is seen

_validationType
type: ObjectProperty
comment: (Modified) VerificationResult.validationType

PermissionRuleDataComponent
type: Class
comment: Permission.Rule.PermissionRuleDataComponent: A description or definition of which activities are allowed to be done on the data.
subclass of: BackboneElement
subclass of: Restriction
  max cardinality: 1
  on property: expression
subclass of: Restriction
  all values from: Expression
  on property: expression
subclass of: Restriction
  all values from: Period
  on property: period
subclass of: Restriction
  all values from: Coding
  on property: security
subclass of: Restriction
  all values from: PermissionRuleDataResourceComponent
  on property: resource

_versionNeeded
type: ObjectProperty
comment: (Modified) CodeSystem.versionNeeded

PackagedProductDefinitionPackagingContainedItemComponent
type: Class
comment: PackagedProductDefinitionPackagingComponent.PackagedProductDefinitionPackagingContainedItemComponent: The item(s) within the packaging.
comment: PackagedProductDefinitionPackagingComponentPackaging.PackagedProductDefinitionPackagingContainedItemComponent: The item(s) within the packaging.
subclass of: BackboneElement
subclass of: Restriction
  cardinality: 1
  on property: item
subclass of: Restriction
  cardinality: 1
  on property: item
subclass of: Restriction
  max cardinality: 1
  on property: amount
subclass of: Restriction
  all values from: Quantity
  on property: amount
subclass of: Restriction
  all values from: CodeableReference
  on property: item
subclass of: Restriction
  all values from: Quantity
  on property: amount
subclass of: Restriction
  all values from: CodeableReference
  on property: item
subclass of: Restriction
  max cardinality: 1
  on property: amount

predecessor
type: ObjectProperty
comment: TestPlan.testCase.dependency.predecessor: Link to predecessor test plans.
comment: TestPlan.dependency.predecessor: Predecessor test plans - those that are expected to be successfully performed as a dependency for the execution of this test plan.
comment: PaymentReconciliation.allocation.predecessor: Unique identifier for the prior payment item for the referenced payable.
modifierExtensionProperty: predecessor
title: TestPlan.testCase.dependency.predecessor: Link to predecessor test plans
title: TestPlan.dependency.predecessor: Link to predecessor test plans
title: PaymentReconciliation.allocation.predecessor: Business identifier of the prior payment detail

ArtifactAssessment
type: Class
comment: This Resource provides one or more comments, classifiers or ratings about a Resource and supports attribution and rights management metadata for the added content.
subclass of: DomainResource
subclass of: clinical.general
subclass of: Restriction
  max cardinality: 1
  on property: disposition
subclass of: Restriction
  all values from: Identifier
  on property: identifier
subclass of: Restriction
  all values from: markdown
  on property: copyright
subclass of:
  union of: Restriction
    all values from: Reference
    on property: citeAs
  union of: Restriction
    max cardinality: 1
    on property: citeAs
  union of: Restriction
    all values from: markdown
    on property: citeAs
  union of: Restriction
    max cardinality: 1
    on property: citeAs
subclass of:
  union of: Restriction
    all values from: Reference
    on property: artifact
  union of: Restriction
    cardinality: 1
    on property: artifact
  union of: Restriction
    all values from: canonical
    on property: artifact
  union of: Restriction
    cardinality: 1
    on property: artifact
  union of: Restriction
    all values from: uri
    on property: artifact
  union of: Restriction
    cardinality: 1
    on property: artifact
subclass of: Restriction
  max cardinality: 1
  on property: workflowStatus
subclass of: Restriction
  all values from: date
  on property: approvalDate
subclass of: Restriction
  all values from: string
  on property: title
subclass of: Restriction
  max cardinality: 1
  on property: copyright
subclass of: Restriction
  all values from: date
  on property: lastReviewDate
subclass of: Restriction
  all values from: code
  on property: workflowStatus
subclass of: Restriction
  max cardinality: 1
  on property: approvalDate
subclass of: Restriction
  max cardinality: 1
  on property: title
subclass of: Restriction
  max cardinality: 1
  on property: date
subclass of: Restriction
  all values from: dateTime
  on property: date
subclass of: Restriction
  all values from: code
  on property: disposition
subclass of: Restriction
  all values from: ArtifactAssessmentContentComponent
  on property: content
subclass of: Restriction
  max cardinality: 1
  on property: lastReviewDate
modifierExtensionClass: ArtifactAssessment

_dependsOn
type: ObjectProperty
comment: (Modified) ImplementationGuide.dependsOn
comment: (Modified) ConceptMap.group.element.target.dependsOn

evidence
type: ObjectProperty
comment: Condition.evidence: Supporting evidence / manifestations that are the basis of the Condition's verification status, such as evidence that confirmed or refuted the condition.
comment: DetectedIssue.evidence: Supporting evidence or manifestations that provide the basis for identifying the detected issue such as a GuidanceResponse or MeasureReport.
comment: Permission.justification.evidence: Justifing rational.
sub property of: why
modifierExtensionProperty: evidence
title: DetectedIssue.evidence: Supporting evidence
title: Permission.justification.evidence: Justifing rational
title: Condition.evidence: Supporting evidence for the verification status

MeasureGroupPopulationComponent
type: Class
comment: MeasureGroupComponent.MeasureGroupPopulationComponent: A population criteria for the measure.
subclass of: BackboneElement
subclass of: Restriction
  all values from: CodeableConcept
  on property: aggregateMethod
subclass of: Restriction
  max cardinality: 1
  on property: inputPopulationId
subclass of: Restriction
  max cardinality: 1
  on property: criteria
subclass of: Restriction
  max cardinality: 1
  on property: code
subclass of: Restriction
  all values from: CodeableConcept
  on property: code
subclass of: Restriction
  max cardinality: 1
  on property: aggregateMethod
subclass of: Restriction
  all values from: string
  on property: inputPopulationId
subclass of: Restriction
  max cardinality: 1
  on property: groupDefinition
subclass of: Restriction
  all values from: string
  on property: linkId
subclass of: Restriction
  all values from: markdown
  on property: description
subclass of: Restriction
  all values from: Reference
  on property: groupDefinition
subclass of: Restriction
  max cardinality: 1
  on property: linkId
subclass of: Restriction
  max cardinality: 1
  on property: description
subclass of: Restriction
  all values from: Expression
  on property: criteria

opticalActivity
type: ObjectProperty
comment: SubstanceDefinition.structure.opticalActivity: Optical activity type.
comment: SubstanceDefinition.moiety.opticalActivity: Optical activity type.
modifierExtensionProperty: opticalActivity
title: SubstanceDefinition.structure.opticalActivity: Optical activity type
title: SubstanceDefinition.moiety.opticalActivity: Optical activity type

nutritionProduct
type: ObjectProperty
comment: NutritionIntake.consumedItem.nutritionProduct: Identifies the food or fluid product that was consumed. This is potentially a link to a resource representing the details of the food product (TBD) or a simple attribute carrying a code that identifies the food from a known list of foods.
sub property of: what
modifierExtensionProperty: nutritionProduct
title: NutritionIntake.consumedItem.nutritionProduct: Code that identifies the food or fluid product that was consumed

specialMeasures
type: ObjectProperty
comment: MedicinalProductDefinition.specialMeasures: Whether the Medicinal Product is subject to special measures for regulatory reasons, such as a requirement to conduct post-authorization studies.
modifierExtensionProperty: specialMeasures
title: MedicinalProductDefinition.specialMeasures: Whether the Medicinal Product is subject to special measures for regulatory reasons

packageId
type: ObjectProperty
comment: ImplementationGuide.dependsOn.packageId: The NPM package name for the Implementation Guide that this IG depends on.
comment: ImplementationGuide.packageId: The NPM package name for this Implementation Guide, used in the NPM package distribution, which is the primary mechanism by which FHIR based tooling manages IG dependencies. This value must be globally unique, and should be assigned with care.
modifierExtensionProperty: _packageId
title: ImplementationGuide.dependsOn.packageId: NPM Package name for IG this depends on
title: ImplementationGuide.packageId: NPM Package name for IG

TerminologyCapabilitiesCodeSystemVersionFilterComponent
type: Class
comment: TerminologyCapabilitiesCodeSystemComponent.TerminologyCapabilitiesCodeSystemVersionComponent.TerminologyCapabilitiesCodeSystemVersionFilterComponent: Filter Properties supported.
subclass of: BackboneElement
subclass of: Restriction
  min cardinality: 1
  on property: op
subclass of: Restriction
  all values from: code
  on property: op
subclass of: Restriction
  cardinality: 1
  on property: code
subclass of: Restriction
  all values from: code
  on property: code

SubDetail
type: Class
comment: ExplanationOfBenefit.Item.Detail.SubDetail: Third-tier of goods and services.
comment: Claim.Item.Detail.SubDetail: A claim detail line. Either a simple (a product or service) or a 'group' of sub-details which are simple items.
comment: ClaimResponse.Item.ItemDetail.SubDetail: A sub-detail adjudication of a simple product or service.
subclass of: BackboneElement
subclass of: Restriction
  all values from: Money
  on property: patientPaid
subclass of: Restriction
  all values from: CodeableConcept
  on property: productOrService
subclass of: Restriction
  all values from: CodeableConcept
  on property: productOrServiceEnd
subclass of: Restriction
  all values from: ClaimResponse.Item.ItemDetail.SubDetailReviewOutcome
  on property: reviewOutcome
subclass of: Restriction
  all values from: CodeableConcept
  on property: category
subclass of: Restriction
  max cardinality: 1
  on property: net
subclass of: Restriction
  max cardinality: 1
  on property: factor
subclass of: Restriction
  all values from: SimpleQuantity
  on property: quantity
subclass of: Restriction
  max cardinality: 1
  on property: factor
subclass of: Restriction
  all values from: Reference
  on property: udi
subclass of: Restriction
  max cardinality: 1
  on property: productOrServiceEnd
subclass of: Restriction
  all values from: positiveInt
  on property: noteNumber
subclass of: Restriction
  all values from: positiveInt
  on property: noteNumber
subclass of: Restriction
  all values from: CodeableConcept
  on property: revenue
subclass of: Restriction
  max cardinality: 1
  on property: productOrServiceEnd
subclass of: Restriction
  max cardinality: 1
  on property: category
subclass of: Restriction
  max cardinality: 1
  on property: tax
subclass of: Restriction
  all values from: CodeableConcept
  on property: programCode
subclass of: Restriction
  all values from: CodeableConcept
  on property: modifier
subclass of: Restriction
  cardinality: 1
  on property: subDetailSequence
subclass of: Restriction
  max cardinality: 1
  on property: revenue
subclass of: Restriction
  all values from: Reference
  on property: udi
subclass of: Restriction
  max cardinality: 1
  on property: quantity
subclass of: Restriction
  all values from: Money
  on property: patientPaid
subclass of: Restriction
  all values from: Identifier
  on property: traceNumber
subclass of: Restriction
  all values from: CodeableConcept
  on property: category
subclass of: Restriction
  all values from: CodeableConcept
  on property: modifier
subclass of: Restriction
  max cardinality: 1
  on property: category
subclass of: Restriction
  all values from: CodeableConcept
  on property: revenue
subclass of: Restriction
  all values from: positiveInt
  on property: sequence
subclass of: Restriction
  max cardinality: 1
  on property: unitPrice
subclass of: Restriction
  all values from: ClaimResponse.Item.ItemDetail.SubDetailAdjudication
  on property: adjudication
subclass of: Restriction
  cardinality: 1
  on property: sequence
subclass of: Restriction
  all values from: CodeableConcept
  on property: programCode
subclass of: Restriction
  all values from: decimal
  on property: factor
subclass of: Restriction
  cardinality: 1
  on property: sequence
subclass of: Restriction
  all values from: positiveInt
  on property: subDetailSequence
subclass of: Restriction
  max cardinality: 1
  on property: productOrService
subclass of: Restriction
  max cardinality: 1
  on property: quantity
subclass of: Restriction
  all values from: Money
  on property: net
subclass of: Restriction
  max cardinality: 1
  on property: unitPrice
subclass of: Restriction
  max cardinality: 1
  on property: net
subclass of: Restriction
  max cardinality: 1
  on property: patientPaid
subclass of: Restriction
  all values from: CodeableConcept
  on property: productOrService
subclass of: Restriction
  max cardinality: 1
  on property: reviewOutcome
subclass of: Restriction
  all values from: Money
  on property: unitPrice
subclass of: Restriction
  max cardinality: 1
  on property: productOrService
subclass of: Restriction
  all values from: CodeableConcept
  on property: productOrServiceEnd
subclass of: Restriction
  all values from: Identifier
  on property: traceNumber
subclass of: Restriction
  all values from: Money
  on property: unitPrice
subclass of: Restriction
  max cardinality: 1
  on property: patientPaid
subclass of: Restriction
  all values from: Money
  on property: tax
subclass of: Restriction
  all values from: positiveInt
  on property: sequence
subclass of: Restriction
  all values from: SimpleQuantity
  on property: quantity
subclass of: Restriction
  all values from: ExplanationOfBenefit.Item.Detail.SubDetailReviewOutcome
  on property: reviewOutcome
subclass of: Restriction
  all values from: Identifier
  on property: traceNumber
subclass of: Restriction
  max cardinality: 1
  on property: reviewOutcome
subclass of: Restriction
  all values from: Money
  on property: net
subclass of: Restriction
  all values from: Money
  on property: tax
subclass of: Restriction
  all values from: decimal
  on property: factor
subclass of: Restriction
  max cardinality: 1
  on property: revenue
subclass of: Restriction
  max cardinality: 1
  on property: tax
subclass of: Restriction
  all values from: ExplanationOfBenefit.Item.Detail.SubDetailAdjudication
  on property: adjudication

_received
type: ObjectProperty
comment: (Modified) Communication.received

CapabilityStatementDocumentComponent
type: Class
comment: CapabilityStatementDocumentComponent: A document definition.
subclass of: BackboneElement
subclass of: Restriction
  all values from: code
  on property: mode
subclass of: Restriction
  all values from: canonical
  on property: profile
subclass of: Restriction
  cardinality: 1
  on property: profile
subclass of: Restriction
  cardinality: 1
  on property: mode
subclass of: Restriction
  max cardinality: 1
  on property: documentation
subclass of: Restriction
  all values from: markdown
  on property: documentation

observationResultRequirement
type: ObjectProperty
comment: ActivityDefinition.observationResultRequirement: Defines the observations that are expected to be produced by the action.
modifierExtensionProperty: observationResultRequirement
title: ActivityDefinition.observationResultRequirement: What observations must be produced by this action

ValueSetExpansionComponent.ValueSetExpansionContainsComponentContainsDesignation
type: Class
comment: Additional representations for this item - other languages, aliases, specialized purposes, used for particular purposes, etc. These are relevant when the conditions of the expansion do not fix to a single correct representation.
subclass of: BackboneElement
subclass of: Restriction
  max cardinality: 1
  on property: language
subclass of: Restriction
  max cardinality: 1
  on property: use
subclass of: Restriction
  all values from: string
  on property: value
subclass of: Restriction
  cardinality: 1
  on property: value
subclass of: Restriction
  all values from: Coding
  on property: additionalUse
subclass of: Restriction
  all values from: code
  on property: language
subclass of: Restriction
  all values from: Coding
  on property: use
title: Additional representations for this item

FriendlyLanguage
type: Class
comment: Contract.FriendlyLanguage: The "patient friendly language" versionof the Contract in whole or in parts. "Patient friendly language" means the representation of the Contract and Contract Provisions in a manner that is readily accessible and understandable by a layperson in accordance with best practices for communication styles that ensure that those agreeing to or signing the Contract understand the roles, actions, obligations, responsibilities, and implication of the agreement.
subclass of: BackboneElement
subclass of:
  union of: Restriction
    all values from: Attachment
    on property: content
  union of: Restriction
    cardinality: 1
    on property: content
  union of: Restriction
    all values from: Reference
    on property: content
  union of: Restriction
    cardinality: 1
    on property: content

_observedGroup
type: ObjectProperty
comment: (Modified) ResearchStudy.comparisonGroup.observedGroup

cancelledReason
type: ObjectProperty
comment: Invoice.cancelledReason: In case of Invoice cancellation a reason must be given (entered in error, superseded by corrected invoice etc.).
modifierExtensionProperty: cancelledReason
title: Invoice.cancelledReason: Reason for cancellation of this Invoice

_expirationType
type: ObjectProperty
comment: (Modified) Contract.expirationType

_actualNumber
type: ObjectProperty
comment: (Modified) ResearchStudy.recruitment.actualNumber

derivation
type: ObjectProperty
comment: StructureDefinition.derivation: How the type relates to the baseDefinition.
modifierExtensionProperty: derivation
title: StructureDefinition.derivation: specialization | constraint - How relates to base definition

AdverseEventSuspectEntityComponent
type: Class
comment: AdverseEventSuspectEntityComponent: Describes the entity that is suspected to have caused the adverse event.
subclass of: BackboneElement
subclass of: Restriction
  max cardinality: 1
  on property: causality
subclass of: Restriction
  all values from: AdverseEventSuspectEntityCausalityComponent
  on property: causality
subclass of:
  union of: Restriction
    all values from: CodeableConcept
    on property: instance
  union of: Restriction
    cardinality: 1
    on property: instance
  union of: Restriction
    all values from: Reference
    on property: instance
  union of: Restriction
    cardinality: 1
    on property: instance

ImmunizationRecommendation
type: Class
comment: A patient's point-in-time set of recommendations (i.e. forecasting) according to a published schedule with optional supporting justification.
subclass of: clinical.medication
subclass of: DomainResource
subclass of: Restriction
  all values from: dateTime
  on property: date
subclass of: Restriction
  all values from: ImmunizationRecommendationRecommendationComponent
  on property: recommendation
subclass of: Restriction
  all values from: Identifier
  on property: identifier
subclass of: Restriction
  cardinality: 1
  on property: date
subclass of: Restriction
  all values from: Reference
  on property: authority
subclass of: Restriction
  all values from: Reference
  on property: patient
subclass of: Restriction
  cardinality: 1
  on property: patient
subclass of: Restriction
  min cardinality: 1
  on property: recommendation
subclass of: Restriction
  max cardinality: 1
  on property: authority
modifierExtensionClass: _ImmunizationRecommendation

_BiologicallyDerivedProductDispense
type: Class
comment: (Modified) BiologicallyDerivedProductDispense
subclass of: DomainResource

_definitionId
type: ObjectProperty
comment: (Modified) EvidenceVariable.characteristic.definitionByCombination.characteristic.definitionId
comment: (Modified) EvidenceVariable.characteristic.definitionId

_authoredOn
type: ObjectProperty
comment: (Modified) ServiceRequest.authoredOn
comment: (Modified) CommunicationRequest.authoredOn
comment: (Modified) MedicationRequest.authoredOn
comment: (Modified) RequestOrchestration.authoredOn
comment: (Modified) Transport.authoredOn
comment: (Modified) DeviceRequest.authoredOn
comment: (Modified) SupplyRequest.authoredOn
comment: (Modified) Task.authoredOn

keyword
type: ObjectProperty
comment: StructureDefinition.keyword: (DEPRECATED) A set of key words or terms from external terminologies that may be used to assist with indexing and searching of templates nby describing the use of this structure definition, or the content it describes.
comment: ResearchStudy.keyword: Key terms to aid in searching for or filtering the study.
modifierExtensionProperty: _keyword
title: StructureDefinition.keyword: Assist with indexing and finding
title: ResearchStudy.keyword: Used to search for the study

characteristic
type: ObjectProperty
comment: PackagedProductDefinition.characteristic: Allows the key features to be recorded, such as "hospital pack", "nurse prescribable", "calendar pack".
comment: EvidenceReport.subject.characteristic: Characteristic.
comment: EvidenceVariable.characteristic.definitionByCombination.characteristic.definitionByCombination.characteristic: A defining factor of the characteristic.
comment: Location.characteristic: Collection of characteristics (attributes).
comment: HealthcareService.characteristic: Collection of characteristics (attributes).
comment: Group.characteristic: Identifies traits whose presence r absence is shared by members of the group.
comment: NutritionProduct.characteristic: Specifies descriptive properties of the nutrition product.
comment: InventoryItem.characteristic: The descriptive or identifying characteristics of the item.
comment: EvidenceVariable.characteristic: A defining factor of the EvidenceVariable. Multiple characteristics are applied with "and" semantics.
comment: EvidenceVariable.characteristic.definitionByCombination.characteristic: A defining factor of the characteristic.
comment: MedicinalProductDefinition.characteristic: Allows the key product features to be recorded, such as "sugar free", "modified release", "parallel import".
comment: PractitionerRole.characteristic: Collection of characteristics (attributes).
modifierExtensionProperty: _characteristic
title: PackagedProductDefinition.characteristic: Allows the key features to be recorded, such as "hospital pack", "nurse prescribable"
title: EvidenceVariable.characteristic.definitionByCombination.characteristic.definitionByCombination.characteristic: A defining factor of the characteristic
title: NutritionProduct.characteristic: Specifies descriptive properties of the nutrition product
title: MedicinalProductDefinition.characteristic: Key product features such as "sugar free", "modified release"
title: Group.characteristic: Include / Exclude group members by Trait
title: HealthcareService.characteristic: Collection of characteristics (attributes)
title: PractitionerRole.characteristic: Collection of characteristics (attributes)
title: EvidenceReport.subject.characteristic: Characteristic
title: EvidenceVariable.characteristic.definitionByCombination.characteristic: A defining factor of the characteristic
title: EvidenceVariable.characteristic: A defining factor of the EvidenceVariable
title: InventoryItem.characteristic: Characteristic of the item
title: Location.characteristic: Collection of characteristics (attributes)

_note
type: ObjectProperty
comment: (Modified) List.note
comment: (Modified) Invoice.note
comment: (Modified) NutritionProduct.note
comment: (Modified) GenomicStudy.note
comment: (Modified) AdverseEvent.note
comment: (Modified) Task.note
comment: (Modified) EvidenceReport.note
comment: (Modified) Citation.citedArtifact.note
comment: (Modified) Evidence.statistic.modelCharacteristic.attributeEstimate.note
comment: (Modified) Contract.term.action.note
comment: (Modified) Condition.note
comment: (Modified) MedicationAdministration.note
comment: (Modified) ResearchStudy.note
comment: (Modified) VisionPrescription.lensSpecification.note
comment: (Modified) MedicationKnowledge.storageGuideline.note
comment: (Modified) Evidence.certainty.note
comment: (Modified) GuidanceResponse.note
comment: (Modified) DeviceDefinition.note
comment: (Modified) Specimen.note
comment: (Modified) EvidenceVariable.characteristic.definitionByCombination.characteristic.note
comment: (Modified) RiskAssessment.note
comment: (Modified) AllergyIntolerance.note
comment: (Modified) Device.note
comment: (Modified) Evidence.statistic.sampleSize.note
comment: (Modified) EvidenceVariable.characteristic.note
comment: (Modified) Evidence.statistic.attributeEstimate.note
comment: (Modified) ChargeItem.note
comment: (Modified) EvidenceVariable.note
comment: (Modified) EvidenceReport.subject.note
comment: (Modified) MedicationRequest.note
comment: (Modified) ImagingStudy.note
comment: (Modified) CareTeam.note
comment: (Modified) AllergyIntolerance.reaction.note
comment: (Modified) EvidenceVariable.characteristic.definitionByCombination.characteristic.timeFromEvent.note
comment: (Modified) EvidenceVariable.characteristic.timeFromEvent.note
comment: (Modified) BiologicallyDerivedProductDispense.note
comment: (Modified) Appointment.note
comment: (Modified) FamilyMemberHistory.procedure.note
comment: (Modified) ServiceRequest.note
comment: (Modified) FamilyMemberHistory.condition.note
comment: (Modified) Procedure.note
comment: (Modified) NutritionOrder.note
comment: (Modified) DeviceDispense.note
comment: (Modified) Citation.note
comment: (Modified) InventoryReport.note
comment: (Modified) Transport.note
comment: (Modified) FamilyMemberHistory.note
comment: (Modified) Evidence.note
comment: (Modified) DiagnosticReport.note
comment: (Modified) ClinicalImpression.note
comment: (Modified) Immunization.note
comment: (Modified) NutritionIntake.note
comment: (Modified) Contract.term.group.action.note
comment: (Modified) Communication.note
comment: (Modified) MedicationDispense.note
comment: (Modified) Observation.note
comment: (Modified) Goal.note
comment: (Modified) Evidence.statistic.note
comment: (Modified) RequestOrchestration.note
comment: (Modified) Composition.note
comment: (Modified) DeviceRequest.note
comment: (Modified) CarePlan.note
comment: (Modified) MedicationStatement.note
comment: (Modified) SubstanceDefinition.note
comment: (Modified) DeviceUsage.note
comment: (Modified) DetectedIssue.mitigation.note
comment: (Modified) Evidence.certainty.subcomponent.note
comment: (Modified) Evidence.variableDefinition.note
comment: (Modified) CommunicationRequest.note
comment: (Modified) SubstanceDefinition.code.note
comment: (Modified) GenomicStudy.analysis.note
comment: (Modified) Evidence.statistic.attributeEstimate.attributeEstimate.note

ImagingStudySeriesInstanceComponent
type: Class
comment: ImagingStudySeriesComponent.ImagingStudySeriesInstanceComponent: A single SOP instance within the series, e.g. an image, or presentation state.
subclass of: BackboneElement
subclass of: Restriction
  all values from: string
  on property: title
subclass of: Restriction
  all values from: unsignedInt
  on property: number
subclass of: Restriction
  cardinality: 1
  on property: sopClass
subclass of: Restriction
  cardinality: 1
  on property: uid
subclass of: Restriction
  max cardinality: 1
  on property: title
subclass of: Restriction
  all values from: Coding
  on property: sopClass
subclass of: Restriction
  max cardinality: 1
  on property: number
subclass of: Restriction
  all values from: id
  on property: uid

_signature
type: ObjectProperty
comment: (Modified) Provenance.signature
comment: (Modified) Contract.signer.signature
comment: (Modified) Bundle.signature

slicing
type: ObjectProperty
comment: ElementDefinition.slicing: Indicates that the element is sliced into a set of alternative definitions (i.e. in a structure definition, there are multiple different constraints on a single element in the base resource). Slicing can be used in any resource that has cardinality ..* on the base resource, or any resource with a choice of types. The set of slices is any elements that come after this in the element sequence that have the same path, until a shorter path occurs (the shorter path terminates the set).
modifierExtensionProperty: _slicing
title: ElementDefinition.slicing: This element is sliced - slices follow

_population
type: ObjectProperty
comment: (Modified) MeasureReport.group.stratifier.stratum.population
comment: (Modified) MeasureReport.group.population
comment: (Modified) Measure.group.population
comment: (Modified) ClinicalUseDefinition.population

cap
type: ObjectProperty
comment: SpecimenDefinition.typeTested.container.cap: Color of container cap.
modifierExtensionProperty: cap
title: SpecimenDefinition.typeTested.container.cap: Color of container cap

given
type: ObjectProperty
comment: HumanName.given: Given name.
modifierExtensionProperty: given
title: HumanName.given: Given names (not always 'first'). Includes middle names

account
type: ObjectProperty
comment: Account.relatedAccount.account: Reference to an associated Account.
comment: PaymentReconciliation.allocation.account: The Account to which this payment applies, may be completed by the receiver, used for search.
comment: Invoice.account: Account which is supposed to be balanced with this Invoice.
comment: EpisodeOfCare.account: The set of accounts that may be used for billing for this EpisodeOfCare.
comment: Encounter.account: The set of accounts that may be used for billing for this Encounter.
comment: ChargeItem.account: Account into which this ChargeItems belongs.
comment: Appointment.account: The set of accounts that is expected to be used for billing the activities that result from this Appointment.
modifierExtensionProperty: _account
title: Account.relatedAccount.account: Reference to an associated Account
title: Encounter.account: The set of accounts that may be used for billing for this Encounter
title: Invoice.account: Account that is being balanced
title: ChargeItem.account: Account to place this charge
title: Appointment.account: The set of accounts that may be used for billing for this Appointment
title: PaymentReconciliation.allocation.account: Applied-to account
title: EpisodeOfCare.account: The set of accounts that may be used for billing for this EpisodeOfCare

_organism
type: ObjectProperty
comment: (Modified) SubstanceSourceMaterial.organism
comment: (Modified) SubstanceReferenceInformation.target.organism

_need
type: ObjectProperty
comment: (Modified) VerificationResult.need

environmentalSetting
type: ObjectProperty
comment: MedicationKnowledge.storageGuideline.environmentalSetting: Describes a setting/value on the environment for the adequate storage of the medication and other substances. Environment settings may involve temperature, humidity, or exposure to light.
modifierExtensionProperty: _environmentalSetting
title: MedicationKnowledge.storageGuideline.environmentalSetting: Setting or value of environment for adequate storage

volume
type: ObjectProperty
comment: Citation.citedArtifact.publicationForm.volume: Volume number of journal or other collection in which the article is published.
modifierExtensionProperty: volume
title: Citation.citedArtifact.publicationForm.volume: Volume number of journal or other collection in which the article is published

weeklyTemplate
type: ObjectProperty
comment: Appointment.recurrenceTemplate.weeklyTemplate: Information about weekly recurring appointments.
modifierExtensionProperty: _weeklyTemplate
title: Appointment.recurrenceTemplate.weeklyTemplate: Information about weekly recurring appointments

lowerLimit
type: ObjectProperty
comment: SampledData.lowerLimit: The lower limit of detection of the measured points. This is needed if any of the data points have the value "L" (lower than detection limit).
modifierExtensionProperty: _lowerLimit
title: SampledData.lowerLimit: Lower limit of detection

_justification
type: ObjectProperty
comment: (Modified) Permission.justification
comment: (Modified) DeviceDefinition.classification.justification

_fixture
type: ObjectProperty
comment: (Modified) TestScript.fixture

unitPriceComponent
type: ObjectProperty
comment: ChargeItem.unitPriceComponent: The unit price of the chargable item.
modifierExtensionProperty: unitPriceComponent
title: ChargeItem.unitPriceComponent: Unit price overriding the associated rules

availabilityStatus
type: ObjectProperty
comment: Device.availabilityStatus: The availability of the device.
sub property of: status
modifierExtensionProperty: availabilityStatus
title: Device.availabilityStatus: lost | damaged | destroyed | available

_proxySignature
type: ObjectProperty
comment: (Modified) VerificationResult.attestation.proxySignature

statusChanged
type: ObjectProperty
comment: MedicationRequest.statusChanged: The date (and perhaps time) when the status was changed.
comment: MedicationDispense.statusChanged: The date (and maybe time) when the status of the dispense record changed.
modifierExtensionProperty: statusChanged
title: MedicationRequest.statusChanged: When the status was changed
title: MedicationDispense.statusChanged: When the status changed

_about
type: ObjectProperty
comment: (Modified) CommunicationRequest.about
comment: (Modified) Communication.about

occurence
type: ObjectProperty
comment: MedicationAdministration.occurence
modifierExtensionProperty: occurence

actualPeriod
type: ObjectProperty
comment: EncounterHistory.actualPeriod: The start and end time associated with this set of values associated with the encounter, may be different to the planned times for various reasons.
comment: Encounter.actualPeriod: The actual start and end time of the encounter.
sub property of: when.done
modifierExtensionProperty: actualPeriod
title: EncounterHistory.actualPeriod: The actual start and end time associated with this set of values associated with the encounter
title: Encounter.actualPeriod: The actual start and end time of the encounter

_originalPrescription
type: ObjectProperty
comment: (Modified) ExplanationOfBenefit.originalPrescription
comment: (Modified) Claim.originalPrescription

_dosage
type: ObjectProperty
comment: (Modified) MedicationStatement.dosage
comment: (Modified) MedicationKnowledge.indicationGuideline.dosingGuideline.dosage.dosage
comment: (Modified) MedicationKnowledge.indicationGuideline.dosingGuideline.dosage
comment: (Modified) MedicationAdministration.dosage
comment: (Modified) ActivityDefinition.dosage

returnedAmount
type: ObjectProperty
comment: PaymentReconciliation.returnedAmount: The amount returned by the receiver which is excess to the amount payable, often referred to as 'change'.
modifierExtensionProperty: _returnedAmount
title: PaymentReconciliation.returnedAmount: Amount returned by the receiver

_cTerminalModification
type: ObjectProperty
comment: (Modified) SubstanceProtein.subunit.cTerminalModification

name
type: ObjectProperty
comment: ObservationDefinition.name: A natural language name identifying the ObservationDefinition. This name should be usable as an identifier for the module by machine processing applications such as code generation.
comment: TestScript.test.name: The name of this test used for tracking/logging purposes by test engines.
comment: TerminologyCapabilities.expansion.parameter.name: Name of the supported expansion parameter.
comment: Schedule.name: Further description of the schedule as it would be presented to a consumer while searching.
comment: PlanDefinition.name: A natural language name identifying the plan definition. This name should be usable as an identifier for the module by machine processing applications such as code generation.
comment: ResearchStudy.associatedParty.name: Name of associated party.
comment: ExtendedContactDetail.name: The name of an individual to contact, some types of contact detail are usually blank.
comment: SubstanceNucleicAcid.subunit.sugar.name: The name of the sugar or sugar-like component that make up the nucleotide.
comment: CapabilityStatement.software.name: Name the software is known by.
comment: ConditionDefinition.name: A natural language name identifying the condition definition. This name should be usable as an identifier for the module by machine processing applications such as code generation.
comment: ImplementationGuide.definition.page.name: The url by which the page should be known when published.
comment: StructureMap.group.name: A unique name for the group for the convenience of human readers.
comment: NutritionProduct.instance.name: The name for the specific product.
comment: SubstanceDefinition.moiety.name: Textual name for this moiety substance.
comment: TerminologyCapabilities.name: A natural language name identifying the terminology capabilities. This name should be usable as an identifier for the module by machine processing applications such as code generation.
comment: InsurancePlan.name: Official name of the health insurance product as designated by the owner.
comment: Contract.name: A natural language name identifying this Contract definition, derivative, or instance in any legal state. Provides additional information about its content. This name should be usable as an identifier for the module by machine processing applications such as code generation.
comment: Location.name: Name of the location as used by humans. Does not need to be unique.
comment: ImplementationGuide.name: A natural language name identifying the implementation guide. This name should be usable as an identifier for the module by machine processing applications such as code generation.
comment: CanonicalResource.name: A natural language name identifying the {{title}}. This name should be usable as an identifier for the resource by machine processing applications such as code generation.
comment: OperationDefinition.parameter.name: The name of used to identify the parameter.
comment: CodeSystem.name: A natural language name identifying the code system. This name should be usable as an identifier for the module by machine processing applications such as code generation.
comment: Library.name: A natural language name identifying the library. This name should be usable as an identifier for the module by machine processing applications such as code generation.
comment: ActorDefinition.name: A natural language name identifying the actor definition. This name should be usable as an identifier for the module by machine processing applications such as code generation.
comment: SubstanceDefinition.name: Names applicable to this substance.
comment: Subscription.parameter.name: Parameter name for information passed to the channel for notifications, for example in the case of a REST hook wanting to pass through an authorization header, the name would be Authorization.
comment: DeviceDefinition.deviceName.name: A human-friendly name that is used to refer to the device - depending on the type, it can be the brand name, the common name or alias, or other.
comment: CoverageEligibilityResponse.insurance.item.name: A short name or tag for the benefit.
comment: FamilyMemberHistory.name: This will either be a name or a description; e.g. "Aunt Susan", "my cousin with the red hair".
comment: CapabilityStatement.name: A natural language name identifying the capability statement. This name should be usable as an identifier for the module by machine processing applications such as code generation.
comment: DeviceDefinition.packaging.distributor.name: Distributor's human-readable name.
comment: ImplementationGuide.definition.page.page.name: The url by which the page should be known when published.
comment: MedicationKnowledge.monitoringProgram.name: Name of the reviewing program.
comment: TestReport.test.name: The name of this test used for tracking/logging purposes by test engines.
comment: SubstanceNucleicAcid.subunit.linkage.name: Each linkage will be registered as a fragment and have at least one name. A single name shall be assigned to each linkage.
comment: ResearchStudy.outcomeMeasure.name: Label for the outcome.
comment: StructureMap.group.rule.dependent.name: Name of a rule or group to apply.
comment: GraphDefinition.name: A natural language name identifying the graph definition. This name should be usable as an identifier for the module by machine processing applications such as code generation.
comment: Contributor.name: The name of the individual or organization responsible for the contribution.
comment: PackagedProductDefinition.name: A name for this package. Typically what it would be listed as in a drug formulary or catalogue, inventory etc.
comment: Coverage.class.name: A short description for the class.
comment: Parameters.parameter.part.name: The name of the parameter (reference to the operation definition).
comment: ResearchStudy.comparisonGroup.name: Unique, human-readable label for this comparisonGroup of the study.
comment: ParameterDefinition.name: The name of the parameter used to allow access to the value of the parameter in evaluation contexts.
comment: Organization.name: A name associated with the organization.
comment: StructureDefinition.name: A natural language name identifying the structure definition. This name should be usable as an identifier for the module by machine processing applications such as code generation.
comment: SearchParameter.name: A natural language name identifying the search parameter. This name should be usable as an identifier for the module by machine processing applications such as code generation.
comment: Subscription.name: A natural language name identifying the subscription.
comment: ImplementationGuide.definition.grouping.name: The human-readable title to display for the package of resources when rendering the implementation guide.
comment: ValueSet.expansion.parameter.name: Name of the input parameter to the $expand operation; may be a server-assigned name for additional default or other server-supplied parameters used to control the expansion process.
comment: InventoryItem.name: The item name(s) - the brand name, or common name, functional name, generic name.
comment: TestReport.name: A free text natural language name identifying the executed TestReport.
comment: ImplementationGuide.manifest.page.name: Relative path to the page.
comment: EvidenceVariable.name: A natural language name identifying the evidence variable. This name should be usable as an identifier for the module by machine processing applications such as code generation.
comment: SubscriptionTopic.name: A natural language name identifying the subscription topic This name should be usable as an identifier for the module by machine processing applications such as code generation.
comment: ManufacturedItemDefinition.name: A descriptive name applied to this item.
comment: CapabilityStatement.rest.operation.name: The name of the operation or query. For an operation, this name is prefixed with $ and used in the URL. For a query, this is the name used in the _query parameter when the query is called. This SHOULD be the same as the OperationDefinition.code of the defining OperationDefinition. However, it can sometimes differ if necessary to disambiguate when a server supports multiple OperationDefinition that happen to share the same code.
comment: RelatedPerson.name: A name associated with the person.
comment: EventDefinition.name: A natural language name identifying the event definition. This name should be usable as an identifier for the module by machine processing applications such as code generation.
comment: TestScript.name: A natural language name identifying the test script. This name should be usable as an identifier for the module by machine processing applications such as code generation.
comment: ConceptMap.name: A natural language name identifying the concept map. This name should be usable as an identifier for the module by machine processing applications such as code generation.
comment: MessageHeader.destination.name: Human-readable name for the target system.
comment: StructureMap.group.rule.name: Name of the rule for internal references.
comment: Citation.name: A natural language name identifying the citation record. This name should be usable as an identifier for the module by machine processing applications such as code generation.
comment: Evidence.name: A natural language name identifying the evidence. This name should be usable as an identifier for the module by machine processing applications such as code generation.
comment: Parameters.parameter.name: The name of the parameter (reference to the operation definition).
comment: MessageHeader.source.name: Human-readable name for the source system.
comment: CareTeam.name: A label for human use intended to distinguish like teams. E.g. the "red" vs. "green" trauma teams.
comment: MedicinalProductDefinition.name: The product's name, including full name and possibly coded parts.
comment: ExplanationOfBenefit.benefitBalance.name: A short name or tag for the benefit.
comment: Patient.contact.name: A name associated with the contact person.
comment: EvidenceVariable.category.name: Description of the grouping.
comment: CapabilityStatement.rest.searchParam.name: The label used for the search parameter in this particular system's API - i.e. the 'name' portion of the name-value pair that will appear as part of the search URL. This SHOULD be the same as the SearchParameter.code of the defining SearchParameter. However, it can sometimes differ if necessary to disambiguate when a server supports multiple SearchParameters that happen to share the same code.
comment: SubstanceDefinition.name.name: The actual name.
comment: Account.name: Name used for the account when displaying it to humans in reports, etc.
comment: ExampleScenario.name: Temporarily retained for tooling purposes.
sub property of: class
sub property of: what
modifierExtensionProperty: name

masterFile
type: ObjectProperty
comment: MedicinalProductDefinition.masterFile: A master file for the medicinal product (e.g. Pharmacovigilance System Master File). Drug master files (DMFs) are documents submitted to regulatory agencies to provide confidential detailed information about facilities, processes or articles used in the manufacturing, processing, packaging and storing of drug products.
modifierExtensionProperty: _masterFile
title: MedicinalProductDefinition.masterFile: A master file for the medicinal product (e.g. Pharmacovigilance System Master File)

baseFormulaType
type: ObjectProperty
comment: NutritionOrder.enteralFormula.baseFormulaType: The type of enteral or infant formula such as an adult standard formula with fiber or a soy-based infant formula.
sub property of: what
modifierExtensionProperty: baseFormulaType
title: NutritionOrder.enteralFormula.baseFormulaType: Type of enteral or infant formula

ValueSetExpansionComponent.ValueSetExpansionContainsComponentContains
type: Class
comment: Other codes and entries contained under this entry in the hierarchy.
subclass of: BackboneElement
subclass of: Restriction
  all values from: boolean
  on property: abstract
subclass of: Restriction
  all values from: ValueSetExpansionComponent.ValueSetExpansionContainsComponentContainsDesignation
  on property: designation
subclass of: Restriction
  max cardinality: 1
  on property: display
subclass of: Restriction
  max cardinality: 1
  on property: inactive
subclass of: Restriction
  max cardinality: 1
  on property: version
subclass of: Restriction
  all values from: ConceptProperty
  on property: property
subclass of: Restriction
  all values from: boolean
  on property: inactive
subclass of: Restriction
  all values from: code
  on property: code
subclass of: Restriction
  max cardinality: 1
  on property: code
subclass of: Restriction
  all values from: uri
  on property: system
subclass of: Restriction
  all values from: string
  on property: display
subclass of: Restriction
  all values from: ValueSetExpansionComponent.ValueSetExpansionContainsComponentContainsContains
  on property: contains
subclass of: Restriction
  max cardinality: 1
  on property: system
subclass of: Restriction
  all values from: string
  on property: version
subclass of: Restriction
  max cardinality: 1
  on property: abstract
title: Codes contained under this entry

threshold
type: ObjectProperty
comment: EvidenceVariable.characteristic.definitionByCombination.characteristic.definitionByCombination.threshold: Provides the value of "n" when "at-least" or "at-most" codes are used.
comment: EvidenceVariable.characteristic.definitionByCombination.threshold: Provides the value of "n" when "at-least" or "at-most" codes are used.
modifierExtensionProperty: _threshold
title: EvidenceVariable.characteristic.definitionByCombination.characteristic.definitionByCombination.threshold: Provides the value of "n" when "at-least" or "at-most" codes are used
title: EvidenceVariable.characteristic.definitionByCombination.threshold: Provides the value of "n" when "at-least" or "at-most" codes are used

active
type: ObjectProperty
comment: Organization.active: Whether the organization's record is still in active use.
comment: OrganizationAffiliation.active: Whether this organization affiliation record is in active use.
comment: Patient.active: Whether this patient record is in active use. Many systems use this property to mark as non-current patients, such as those that have not been seen for a period of time based on an organization's business rules. It is often used to filter patient lists to exclude inactive patients Deceased patients may also be marked as inactive for the same reasons, but may be active for some time after death.
comment: RelatedPerson.active: Whether this related person record is in active use.
comment: HealthcareService.active: This flag is used to mark the record to not be used. This is not used when a center is closed for maintenance, or for holidays, the notAvailable period is to be used for this.
comment: PractitionerRole.active: Whether this practitioner role record is in active use. Some systems may use this property to mark non-active practitioners, such as those that are not currently employed.
comment: Practitioner.active: Whether this practitioner's record is in active use.
comment: Linkage.active: Indicates whether the asserted set of linkages are considered to be "in effect".
comment: BodyStructure.active: Whether this body site is in active use.
comment: Person.active: Whether this person's record is in active use.
comment: Schedule.active: Whether this schedule record is in active use or should not be used (such as was entered in error).
comment: Group.active: Indicates whether the record for the group is available for use or is merely being retained for historical purposes.
sub property of: status
modifierExtensionProperty: active
title: PractitionerRole.active: Whether this practitioner role record is in active use
title: OrganizationAffiliation.active: Whether this organization affiliation record is in active use
title: Person.active: This person's record is in active use
title: Organization.active: Whether the organization's record is still in active use
title: Schedule.active: Whether this schedule is in active use
title: BodyStructure.active: Whether this record is in active use
title: Linkage.active: Whether this linkage assertion is active or not
title: Patient.active: Whether this patient's record is in active use
title: RelatedPerson.active: Whether this related person's record is in active use
title: Practitioner.active: Whether this practitioner's record is in active use
title: Group.active: Whether this group's record is in active use
title: HealthcareService.active: Whether this HealthcareService record is in active use

IngredientSubstanceComponent
type: Class
comment: IngredientSubstanceComponent: The substance that comprises this ingredient.
subclass of: BackboneElement
subclass of: Restriction
  all values from: IngredientSubstanceStrengthComponent
  on property: strength
subclass of: Restriction
  cardinality: 1
  on property: code
subclass of: Restriction
  all values from: CodeableReference
  on property: code

size
type: ObjectProperty
comment: Attachment.size: The number of bytes of data that make up this attachment (before base64 encoding, if that is done).
modifierExtensionProperty: _size
title: Attachment.size: Number of bytes of content (if url provided)

_validityPeriod
type: ObjectProperty
comment: (Modified) RegulatedAuthorization.validityPeriod
comment: (Modified) MedicationRequest.dispenseRequest.validityPeriod

who
type: ObjectProperty
comment: Provenance.entity.agent.who: Indicates who or what performed in the event.
comment: AuditEvent.entity.agent.who: Reference to who this agent is that was involved in the event.
comment: AuditEvent.agent.who: Reference to who this agent is that was involved in the event.
comment: VerificationResult.attestation.who: The individual or organization attesting to information.
comment: VerificationResult.primarySource.who: Reference to the primary source.
comment: Signature.who: A reference to an application-usable description of the identity that signed (e.g. the signature used their private key).
comment: Provenance.agent.who: Indicates who or what performed in the event.
sub property of: who
sub property of: who.actor
modifierExtensionProperty: who
title: VerificationResult.primarySource.who: Reference to the primary source
title: AuditEvent.agent.who: Identifier of who
title: Provenance.entity.agent.who: The agent that participated in the event
title: VerificationResult.attestation.who: The individual or organization attesting to information
title: Provenance.agent.who: The agent that participated in the event
title: AuditEvent.entity.agent.who: Identifier of who
title: Signature.who: Who signed

ExampleScenarioProcessStepAlternativeComponent
type: Class
comment: ExampleScenarioProcessComponent.ExampleScenarioProcessStepComponent.ExampleScenarioProcessStepAlternativeComponentStepProcess.ExampleScenarioProcessStepComponent.ExampleScenarioProcessStepAlternativeComponent: Indicates an alternative step that can be taken instead of the sub-process, scenario or operation. E.g. to represent non-happy-path/exceptional/atypical circumstances.
comment: ExampleScenarioProcessComponent.ExampleScenarioProcessStepComponent.ExampleScenarioProcessStepAlternativeComponent: Indicates an alternative step that can be taken instead of the sub-process, scenario or operation. E.g. to represent non-happy-path/exceptional/atypical circumstances.
comment: ExampleScenarioProcessComponent.ExampleScenarioProcessStepComponentProcess.ExampleScenarioProcessStepComponent.ExampleScenarioProcessStepAlternativeComponent: Indicates an alternative step that can be taken instead of the sub-process, scenario or operation. E.g. to represent non-happy-path/exceptional/atypical circumstances.
comment: ExampleScenarioProcessComponent.ExampleScenarioProcessStepComponent.ExampleScenarioProcessStepAlternativeComponentStep.ExampleScenarioProcessStepAlternativeComponent: Indicates an alternative step that can be taken instead of the sub-process, scenario or operation. E.g. to represent non-happy-path/exceptional/atypical circumstances.
comment: ExampleScenarioProcessComponent.ExampleScenarioProcessStepComponentProcess.ExampleScenarioProcessStepComponent.ExampleScenarioProcessStepAlternativeComponentStep.ExampleScenarioProcessStepAlternativeComponent: Indicates an alternative step that can be taken instead of the sub-process, scenario or operation. E.g. to represent non-happy-path/exceptional/atypical circumstances.
subclass of: BackboneElement
subclass of: Restriction
  cardinality: 1
  on property: title
subclass of: Restriction
  all values from: markdown
  on property: description
subclass of: Restriction
  all values from: ExampleScenarioProcessComponent.ExampleScenarioProcessStepComponentProcess.ExampleScenarioProcessStepComponent.ExampleScenarioProcessStepAlternativeComponentStep
  on property: step
subclass of: Restriction
  all values from: ExampleScenarioProcessComponent.ExampleScenarioProcessStepComponent.ExampleScenarioProcessStepAlternativeComponentStepProcess.ExampleScenarioProcessStepComponent.ExampleScenarioProcessStepAlternativeComponentStep
  on property: step
subclass of: Restriction
  all values from: markdown
  on property: description
subclass of: Restriction
  all values from: string
  on property: title
subclass of: Restriction
  all values from: markdown
  on property: description
subclass of: Restriction
  all values from: markdown
  on property: description
subclass of: Restriction
  cardinality: 1
  on property: title
subclass of: Restriction
  max cardinality: 1
  on property: description
subclass of: Restriction
  all values from: string
  on property: title
subclass of: Restriction
  all values from: ExampleScenarioProcessComponent.ExampleScenarioProcessStepComponentProcess.ExampleScenarioProcessStepComponent.ExampleScenarioProcessStepAlternativeComponentStep.ExampleScenarioProcessStepAlternativeComponentStep
  on property: step
subclass of: Restriction
  cardinality: 1
  on property: title
subclass of: Restriction
  all values from: markdown
  on property: description
subclass of: Restriction
  all values from: ExampleScenarioProcessComponent.ExampleScenarioProcessStepComponent.ExampleScenarioProcessStepAlternativeComponentStep
  on property: step
subclass of: Restriction
  cardinality: 1
  on property: title
subclass of: Restriction
  max cardinality: 1
  on property: description
subclass of: Restriction
  all values from: string
  on property: title
subclass of: Restriction
  cardinality: 1
  on property: title
subclass of: Restriction
  all values from: string
  on property: title
subclass of: Restriction
  max cardinality: 1
  on property: description
subclass of: Restriction
  max cardinality: 1
  on property: description
subclass of: Restriction
  max cardinality: 1
  on property: description
subclass of: Restriction
  all values from: string
  on property: title
subclass of: Restriction
  all values from: ExampleScenarioProcessComponent.ExampleScenarioProcessStepComponent.ExampleScenarioProcessStepAlternativeComponentStep.ExampleScenarioProcessStepAlternativeComponentStep
  on property: step

InsurancePlanPlanSpecificCostComponent
type: Class
comment: InsurancePlanPlanComponent.InsurancePlanPlanSpecificCostComponent: Costs associated with the coverage provided by the product.
subclass of: BackboneElement
subclass of: Restriction
  all values from: PlanBenefit
  on property: benefit
subclass of: Restriction
  cardinality: 1
  on property: category
subclass of: Restriction
  all values from: CodeableConcept
  on property: category

interaction
type: ObjectProperty
comment: CapabilityStatement.rest.interaction: A specification of restful operations supported by the system.
comment: CapabilityStatement.rest.resource.interaction: Identifies a restful operation supported by the solution.
comment: SubstanceReferenceInformation.target.interaction: Todo.
comment: ClinicalUseDefinition.interaction: Specifics for when this is an interaction.
modifierExtensionProperty: interaction
title: CapabilityStatement.rest.interaction: What operations are supported?
title: SubstanceReferenceInformation.target.interaction: Todo
title: ClinicalUseDefinition.interaction: Specifics for when this is an interaction
title: CapabilityStatement.rest.resource.interaction: What operations are supported?

_beneficiary
type: ObjectProperty
comment: (Modified) Coverage.beneficiary

requestURL
type: ObjectProperty
comment: TestScript.test.action.assert.requestURL: The value to use in a comparison against the request URL path string.
comment: TestScript.setup.action.assert.requestURL: The value to use in a comparison against the request URL path string.
modifierExtensionProperty: _requestURL
title: TestScript.test.action.assert.requestURL: Request URL comparison value
title: TestScript.setup.action.assert.requestURL: Request URL comparison value

transform
type: ObjectProperty
comment: StructureMap.group.rule.rule.target.transform: How the data is copied / created.
comment: ActivityDefinition.transform: A reference to a StructureMap resource that defines a transform that can be executed to produce the intent resource using the ActivityDefinition instance as the input.
comment: StructureMap.group.rule.target.transform: How the data is copied / created.
comment: PlanDefinition.action.transform: A reference to a StructureMap resource that defines a transform that can be executed to produce the intent resource using the ActivityDefinition instance as the input.
comment: RequestOrchestration.action.transform: A reference to a StructureMap resource that defines a transform that can be executed to produce the intent resource using the ActivityDefinition instance as the input.
comment: RequestOrchestration.action.action.transform: A reference to a StructureMap resource that defines a transform that can be executed to produce the intent resource using the ActivityDefinition instance as the input.
comment: PlanDefinition.action.action.transform: A reference to a StructureMap resource that defines a transform that can be executed to produce the intent resource using the ActivityDefinition instance as the input.
modifierExtensionProperty: _transform
title: ActivityDefinition.transform: Transform to apply the template
title: PlanDefinition.action.transform: Transform to apply the template
title: StructureMap.group.rule.target.transform: create | copy +
title: RequestOrchestration.action.transform: Transform to apply the template
title: StructureMap.group.rule.rule.target.transform: create | copy +
title: RequestOrchestration.action.action.transform: Transform to apply the template
title: PlanDefinition.action.action.transform: Transform to apply the template

sugar
type: ObjectProperty
comment: SubstanceNucleicAcid.subunit.sugar: 5.3.6.8.1 Sugar ID (Mandatory).
modifierExtensionProperty: sugar
title: SubstanceNucleicAcid.subunit.sugar: 5.3.6.8.1 Sugar ID (Mandatory)

_subscriptionTopic
type: ObjectProperty
comment: (Modified) TriggerDefinition.subscriptionTopic

_usageStatus
type: ObjectProperty
comment: (Modified) DeviceUsage.usageStatus

_recurring
type: ObjectProperty
comment: (Modified) AppointmentResponse.recurring

chargeItem
type: ObjectProperty
comment: Invoice.lineItem.chargeItem
comment: DeviceDefinition.chargeItem: Billing code or reference associated with the device.
modifierExtensionProperty: _chargeItem
title: DeviceDefinition.chargeItem: Billing code or reference associated with the device

DiagnosticReportMediaComponent
type: Class
comment: DiagnosticReportMediaComponent: A list of key images or data associated with this report. The images or data are generally created during the diagnostic process, and may be directly of the patient, or of treated specimens (i.e. slides of interest).
subclass of: BackboneElement
subclass of: Restriction
  cardinality: 1
  on property: link
subclass of: Restriction
  all values from: Reference
  on property: link
subclass of: Restriction
  max cardinality: 1
  on property: comment
subclass of: Restriction
  all values from: string
  on property: comment

validationProcess
type: ObjectProperty
comment: VerificationResult.validationProcess: The primary process by which the target is validated (edit check; value set; primary source; multiple sources; standalone; in context).
modifierExtensionProperty: validationProcess
title: VerificationResult.validationProcess: The primary process by which the target is validated (edit check; value set; primary source; multiple sources; standalone; in context)

_DiagnosticReport
type: Class
comment: (Modified) DiagnosticReport
subclass of: DomainResource

moiety
type: ObjectProperty
comment: SubstanceDefinition.moiety: Moiety, for structural modifications.
modifierExtensionProperty: moiety
title: SubstanceDefinition.moiety: Moiety, for structural modifications

_marketingStatus
type: ObjectProperty
comment: (Modified) PackagedProductDefinition.marketingStatus
comment: (Modified) MedicinalProductDefinition.marketingStatus
comment: (Modified) ManufacturedItemDefinition.marketingStatus

_citedArtifact
type: ObjectProperty
comment: (Modified) Citation.citedArtifact

CitationCitedArtifactPartComponent
type: Class
comment: CitationCitedArtifactComponent.CitationCitedArtifactPartComponent: The component of the article or artifact.
subclass of: BackboneElement
subclass of: Restriction
  max cardinality: 1
  on property: value
subclass of: Restriction
  all values from: Reference
  on property: baseCitation
subclass of: Restriction
  all values from: CodeableConcept
  on property: type
subclass of: Restriction
  max cardinality: 1
  on property: baseCitation
subclass of: Restriction
  all values from: string
  on property: value
subclass of: Restriction
  max cardinality: 1
  on property: type

TerminologyCapabilitiesImplementationComponent
type: Class
comment: TerminologyCapabilitiesImplementationComponent: Identifies a specific implementation instance that is described by the terminology capability statement - i.e. a particular installation, rather than the capabilities of a software program.
subclass of: BackboneElement
subclass of: Restriction
  max cardinality: 1
  on property: url
subclass of: Restriction
  all values from: url
  on property: url
subclass of: Restriction
  cardinality: 1
  on property: description
subclass of: Restriction
  all values from: string
  on property: description

_immutable
type: ObjectProperty
comment: (Modified) ValueSet.immutable

_requester
type: ObjectProperty
comment: (Modified) Contract.term.action.requester
comment: (Modified) ServiceRequest.requester
comment: (Modified) DeviceRequest.requester
comment: (Modified) Task.requester
comment: (Modified) Contract.term.group.action.requester
comment: (Modified) CommunicationRequest.requester
comment: (Modified) Transport.requester
comment: (Modified) SupplyRequest.requester
comment: (Modified) MedicationRequest.requester

regionsStudied
type: ObjectProperty
comment: GenomicStudy.analysis.regionsStudied: The genomic regions to be studied in the analysis (BED file).
modifierExtensionProperty: _regionsStudied
title: GenomicStudy.analysis.regionsStudied: The genomic regions to be studied in the analysis (BED file)

_code
type: ObjectProperty
comment: (Modified) ClinicalUseDefinition.warning.code
comment: (Modified) DeviceRequest.code
comment: (Modified) ValueSet.compose.include.concept.code
comment: (Modified) ValueSet.expansion.contains.contains.code
comment: (Modified) CodeSystem.concept.concept.property.code
comment: (Modified) ClaimResponse.error.code
comment: (Modified) Account.procedure.code
comment: (Modified) AdministrableProductDefinition.routeOfAdministration.code
comment: (Modified) RequestOrchestration.action.action.code
comment: (Modified) ConditionDefinition.medication.code
comment: (Modified) Contract.term.group.asset.context.code
comment: (Modified) MeasureReport.group.stratifier.stratum.component.code
comment: (Modified) Measure.group.stratifier.code
comment: (Modified) AllergyIntolerance.code
comment: (Modified) SubstancePolymer.monomerSet.startingMaterial.code
comment: (Modified) ConceptMap.property.code
comment: (Modified) ChargeItem.code
comment: (Modified) Organization.qualification.code
comment: (Modified) PackagedProductDefinition.legalStatusOfSupply.code
comment: (Modified) MeasureReport.group.code
comment: (Modified) RiskAssessment.code
comment: (Modified) MessageHeader.response.code
comment: (Modified) ValueSet.compose.exclude.concept.code
comment: (Modified) ExplanationOfBenefit.supportingInfo.code
comment: (Modified) Coding.code
comment: (Modified) CoverageEligibilityResponse.error.code
comment: (Modified) CompartmentDefinition.code
comment: (Modified) PractitionerRole.code
comment: (Modified) FamilyMemberHistory.condition.code
comment: (Modified) AuditEvent.outcome.code
comment: (Modified) OrganizationAffiliation.code
comment: (Modified) Observation.component.code
comment: (Modified) Measure.group.code
comment: (Modified) Medication.code
comment: (Modified) Claim.supportingInfo.code
comment: (Modified) Evidence.statistic.modelCharacteristic.code
comment: (Modified) Timing.code
comment: (Modified) UsageContext.code
comment: (Modified) Questionnaire.item.code
comment: (Modified) ServiceRequest.orderDetail.parameter.code
comment: (Modified) SubstanceDefinition.code
comment: (Modified) Transport.code
comment: (Modified) Condition.code
comment: (Modified) PlanDefinition.action.action.code
comment: (Modified) MessageDefinition.focus.code
comment: (Modified) Questionnaire.code
comment: (Modified) MeasureReport.group.stratifier.stratum.population.code
comment: (Modified) Ingredient.substance.code
comment: (Modified) Consent.provision.provision.code
comment: (Modified) DeviceRequest.parameter.code
comment: (Modified) Measure.group.stratifier.component.code
comment: (Modified) EvidenceReport.relatesTo.code
comment: (Modified) Measure.supplementalData.code
comment: (Modified) ValueSet.expansion.contains.contains.property.code
comment: (Modified) ImagingSelection.code
comment: (Modified) AdverseEvent.code
comment: (Modified) MeasureReport.group.population.code
comment: (Modified) OperationOutcome.issue.code
comment: (Modified) EvidenceVariable.characteristic.definitionByCombination.characteristic.definitionByCombination.code
comment: (Modified) DocumentReference.relatesTo.code
comment: (Modified) Basic.code
comment: (Modified) ConditionDefinition.observation.code
comment: (Modified) CodeSystem.property.code
comment: (Modified) MedicationStatement.adherence.code
comment: (Modified) ConceptMap.group.element.code
comment: (Modified) AuditEvent.code
comment: (Modified) EvidenceReport.subject.characteristic.code
comment: (Modified) DetectedIssue.evidence.code
comment: (Modified) Contract.term.asset.context.code
comment: (Modified) CapabilityStatement.rest.interaction.code
comment: (Modified) DeviceUsage.adherence.code
comment: (Modified) List.code
comment: (Modified) CodeSystem.concept.code
comment: (Modified) ElementDefinition.type.code
comment: (Modified) Procedure.code
comment: (Modified) ValueSet.expansion.contains.property.code
comment: (Modified) ActivityDefinition.code
comment: (Modified) ImplementationGuide.definition.parameter.code
comment: (Modified) ConceptMap.group.element.target.code

sourceMaterial
type: ObjectProperty
comment: SubstanceDefinition.sourceMaterial: Material or taxonomic/anatomical source for the substance.
modifierExtensionProperty: _sourceMaterial
title: SubstanceDefinition.sourceMaterial: Material or taxonomic/anatomical source

subrogation
type: ObjectProperty
comment: Coverage.subrogation: When 'subrogation=true' this insurance instance has been included not for adjudication but to provide insurers with the details to recover costs.
modifierExtensionProperty: subrogation
title: Coverage.subrogation: Reimbursement to insurer

_structureVersion
type: ObjectProperty
comment: (Modified) ExampleScenario.instance.structureVersion

_priceComponent
type: ObjectProperty
comment: (Modified) Invoice.lineItem.priceComponent
comment: (Modified) ChargeItemDefinition.propertyGroup.priceComponent

management
type: ObjectProperty
comment: ClinicalUseDefinition.interaction.management: Actions for managing the interaction.
modifierExtensionProperty: _management
title: ClinicalUseDefinition.interaction.management: Actions for managing the interaction

_additionalInstruction
type: ObjectProperty
comment: (Modified) Dosage.additionalInstruction

_managingEntity
type: ObjectProperty
comment: (Modified) Subscription.managingEntity
comment: (Modified) Group.managingEntity

patchFormat
type: ObjectProperty
comment: CapabilityStatement.patchFormat: A list of the patch formats supported by this implementation using their content types.
modifierExtensionProperty: patchFormat
title: CapabilityStatement.patchFormat: Patch formats supported

proxyIdentityCertificate
type: ObjectProperty
comment: VerificationResult.attestation.proxyIdentityCertificate: A digital identity certificate associated with the proxy entity submitting attested information on behalf of the attestation source.
modifierExtensionProperty: proxyIdentityCertificate
title: VerificationResult.attestation.proxyIdentityCertificate: A digital identity certificate associated with the proxy entity submitting attested information on behalf of the attestation source

DeviceVersionComponent
type: Class
comment: DeviceVersionComponent: The actual design of the device or software version running on the device.
subclass of: BackboneElement
subclass of: Restriction
  max cardinality: 1
  on property: installDate
subclass of: Restriction
  all values from: string
  on property: value
subclass of: Restriction
  max cardinality: 1
  on property: component
subclass of: Restriction
  all values from: dateTime
  on property: installDate
subclass of: Restriction
  all values from: CodeableConcept
  on property: type
subclass of: Restriction
  all values from: Identifier
  on property: component
subclass of: Restriction
  max cardinality: 1
  on property: type
subclass of: Restriction
  cardinality: 1
  on property: value

TaskRestrictionComponent
type: Class
comment: TaskRestrictionComponent: If the Task.focus is a request resource and the task is seeking fulfillment (i.e. is asking for the request to be actioned), this element identifies any limitations on what parts of the referenced request should be actioned.
subclass of: BackboneElement
subclass of: Restriction
  all values from: Reference
  on property: recipient
subclass of: Restriction
  max cardinality: 1
  on property: period
subclass of: Restriction
  all values from: Period
  on property: period
subclass of: Restriction
  max cardinality: 1
  on property: repetitions
subclass of: Restriction
  all values from: positiveInt
  on property: repetitions

_frameOfReferenceUid
type: ObjectProperty
comment: (Modified) ImagingSelection.frameOfReferenceUid

FHIR Model Ontology
type: Ontology
comment: Formal model of FHIR Clinical Resources
imports: w5.ttl
version IRI: fhir.ttl

MedicinalProductDefinition
type: Class
comment: Detailed definition of a medicinal product, typically for uses other than direct patient care (e.g. regulatory use, drug catalogs, to support prescribing, adverse events management etc.).
subclass of: DomainResource
subclass of: administrative.medication
subclass of: Restriction
  all values from: MedicinalProductDefinitionOperationComponent
  on property: operation
subclass of: Restriction
  all values from: Reference
  on property: masterFile
subclass of: Restriction
  all values from: CodeableConcept
  on property: status
subclass of: Restriction
  all values from: CodeableConcept
  on property: type
subclass of: Restriction
  max cardinality: 1
  on property: additionalMonitoringIndicator
subclass of: Restriction
  max cardinality: 1
  on property: pediatricUseIndicator
subclass of: Restriction
  all values from: CodeableConcept
  on property: pediatricUseIndicator
subclass of: Restriction
  all values from: CodeableConcept
  on property: additionalMonitoringIndicator
subclass of: Restriction
  all values from: CodeableConcept
  on property: ingredient
subclass of: Restriction
  max cardinality: 1
  on property: statusDate
subclass of: Restriction
  max cardinality: 1
  on property: indication
subclass of: Restriction
  all values from: CodeableConcept
  on property: route
subclass of: Restriction
  all values from: CodeableConcept
  on property: combinedPharmaceuticalDoseForm
subclass of: Restriction
  all values from: markdown
  on property: indication
subclass of: Restriction
  all values from: CodeableConcept
  on property: domain
subclass of: Restriction
  max cardinality: 1
  on property: combinedPharmaceuticalDoseForm
subclass of: Restriction
  all values from: Reference
  on property: attachedDocument
subclass of: Restriction
  all values from: Coding
  on property: code
subclass of: Restriction
  max cardinality: 1
  on property: version
subclass of: Restriction
  all values from: MedicinalProductDefinitionCrossReferenceComponent
  on property: crossReference
subclass of: Restriction
  all values from: CodeableReference
  on property: impurity
subclass of: Restriction
  max cardinality: 1
  on property: legalStatusOfSupply
subclass of: Restriction
  all values from: CodeableConcept
  on property: classification
subclass of: Restriction
  all values from: CodeableConcept
  on property: packagedMedicinalProduct
subclass of: Restriction
  all values from: dateTime
  on property: statusDate
subclass of: Restriction
  all values from: CodeableConcept
  on property: specialMeasures
subclass of: Restriction
  max cardinality: 1
  on property: description
subclass of: Restriction
  max cardinality: 1
  on property: type
subclass of: Restriction
  all values from: MedicinalProductDefinitionCharacteristicComponent
  on property: characteristic
subclass of: Restriction
  all values from: MedicinalProductDefinitionContactComponent
  on property: contact
subclass of: Restriction
  all values from: CodeableConcept
  on property: legalStatusOfSupply
subclass of: Restriction
  all values from: Identifier
  on property: identifier
subclass of: Restriction
  max cardinality: 1
  on property: domain
subclass of: Restriction
  all values from: markdown
  on property: description
subclass of: Restriction
  all values from: MarketingStatus
  on property: marketingStatus
subclass of: Restriction
  all values from: MedicinalProductDefinitionNameComponent
  on property: name
subclass of: Restriction
  all values from: Reference
  on property: comprisedOf
subclass of: Restriction
  min cardinality: 1
  on property: name
subclass of: Restriction
  max cardinality: 1
  on property: status
subclass of: Restriction
  all values from: string
  on property: version
subclass of: Restriction
  all values from: Reference
  on property: clinicalTrial
modifierExtensionClass: _MedicinalProductDefinition

paternalOrganismId
type: ObjectProperty
comment: SubstanceSourceMaterial.organism.hybrid.paternalOrganismId: The identifier of the paternal species constituting the hybrid organism shall be specified based on a controlled vocabulary.
modifierExtensionProperty: paternalOrganismId
title: SubstanceSourceMaterial.organism.hybrid.paternalOrganismId: The identifier of the paternal species constituting the hybrid organism shall be specified based on a controlled vocabulary

averageMolecularFormula
type: ObjectProperty
comment: SubstancePolymer.repeat.averageMolecularFormula: A representation of an (average) molecular formula from a polymer.
modifierExtensionProperty: _averageMolecularFormula
title: SubstancePolymer.repeat.averageMolecularFormula: A representation of an (average) molecular formula from a polymer

EvidenceStatisticSampleSizeComponent
type: Class
comment: EvidenceStatisticComponent.EvidenceStatisticSampleSizeComponent: Number of samples in the statistic.
subclass of: BackboneElement
subclass of: Restriction
  max cardinality: 1
  on property: numberOfParticipants
subclass of: Restriction
  all values from: Annotation
  on property: note
subclass of: Restriction
  max cardinality: 1
  on property: description
subclass of: Restriction
  all values from: unsignedInt
  on property: numberOfParticipants
subclass of: Restriction
  max cardinality: 1
  on property: numberOfStudies
subclass of: Restriction
  all values from: unsignedInt
  on property: knownDataCount
subclass of: Restriction
  all values from: markdown
  on property: description
subclass of: Restriction
  all values from: unsignedInt
  on property: numberOfStudies
subclass of: Restriction
  max cardinality: 1
  on property: knownDataCount

_occurred
type: ObjectProperty
comment: (Modified) Provenance.occurred
comment: (Modified) AuditEvent.occurred

definitionByCombination
type: ObjectProperty
comment: EvidenceVariable.characteristic.definitionByCombination: Defines the characteristic as a combination of two or more characteristics.
comment: EvidenceVariable.characteristic.definitionByCombination.characteristic.definitionByCombination: Defines the characteristic as a combination of two or more characteristics.
modifierExtensionProperty: definitionByCombination
title: EvidenceVariable.characteristic.definitionByCombination: Used to specify how two or more characteristics are combined
title: EvidenceVariable.characteristic.definitionByCombination.characteristic.definitionByCombination: Used to specify how two or more characteristics are combined

_compositional
type: ObjectProperty
comment: (Modified) TerminologyCapabilities.codeSystem.version.compositional
comment: (Modified) CodeSystem.compositional

financial
type: ObjectProperty
comment: ExplanationOfBenefit.benefitBalance.financial: Benefits Used to date.
modifierExtensionProperty: _financial
title: ExplanationOfBenefit.benefitBalance.financial: Benefit Summary

_bodysite
type: ObjectProperty
comment: (Modified) ChargeItem.bodysite

sourceScope
type: ObjectProperty
comment: ConceptMap.sourceScope
modifierExtensionProperty: sourceScope

modifierExtensionClass
type: AnnotationProperty
comment: has modifier extension class

parameter
type: ObjectProperty
comment: ServiceRequest.orderDetail.parameter: The parameter details for the service being requested.
comment: StructureMap.group.rule.dependent.parameter: Parameter to pass to the rule or group.
comment: TerminologyCapabilities.expansion.parameter: Supported expansion parameter.
comment: StructureMap.group.rule.rule.dependent.parameter: Parameter to pass to the rule or group.
comment: ValueSet.expansion.parameter: A parameter that controlled the expansion process. These parameters may be used by users of expanded value sets to check whether the expansion is suitable for a particular purpose, or to pick the correct expansion.
comment: StructureMap.group.rule.rule.target.parameter: Parameters to the transform.
comment: ImplementationGuide.definition.parameter: A set of parameters that defines how the implementation guide is built. The parameters are defined by the relevant tools that build the implementation guides.
comment: DeviceRequest.parameter: Specific parameters for the ordered item. For example, the prism value for lenses.
comment: OperationDefinition.parameter: The parameters for the operation/query.
comment: StructureMap.group.rule.target.parameter: Parameters to the transform.
comment: Library.parameter: The parameter element defines parameters used by the library.
comment: Subscription.parameter: Channel-dependent information to send as part of the notification (e.g., HTTP Headers).
comment: SupplyRequest.parameter: Specific parameters for the ordered item. For example, the size of the indicated item.
comment: Parameters.parameter: A parameter passed to or received from the operation.
sub property of: what
modifierExtensionProperty: parameter
title: OperationDefinition.parameter: Parameters for the operation/query
title: Subscription.parameter: Channel type
title: StructureMap.group.rule.target.parameter: Parameters to the transform
title: TerminologyCapabilities.expansion.parameter: Supported expansion parameter
title: SupplyRequest.parameter: Ordered item details
title: ServiceRequest.orderDetail.parameter: The parameter details for the service being requested
title: Library.parameter: Parameters defined by the library
title: ValueSet.expansion.parameter: Parameter that controlled the expansion process
title: DeviceRequest.parameter: Device details
title: StructureMap.group.rule.rule.dependent.parameter: Parameter to pass to the rule or group
title: StructureMap.group.rule.rule.target.parameter: Parameters to the transform
title: Parameters.parameter: Operation Parameter
title: ImplementationGuide.definition.parameter: Defines how IG is built by tools
title: StructureMap.group.rule.dependent.parameter: Parameter to pass to the rule or group

lineItem
type: ObjectProperty
comment: Invoice.lineItem: Each line item represents one charge for goods and services rendered. Details such.ofType(date), code and amount are found in the referenced ChargeItem resource.
modifierExtensionProperty: lineItem
title: Invoice.lineItem: Line items of this Invoice

_businessArrangement
type: ObjectProperty
comment: (Modified) CoverageEligibilityRequest.insurance.businessArrangement
comment: (Modified) ClaimResponse.insurance.businessArrangement
comment: (Modified) Claim.insurance.businessArrangement

_ordinalPosition
type: ObjectProperty
comment: (Modified) MolecularSequence.relative.ordinalPosition

dependency
type: ObjectProperty
comment: TestPlan.testCase.dependency: The required criteria to execute the test case - e.g. preconditions, previous tests.
comment: TestPlan.dependency: The required criteria to execute the test plan - e.g. preconditions, previous tests...
modifierExtensionProperty: _dependency
title: TestPlan.testCase.dependency: Required criteria to execute the test case
title: TestPlan.dependency: The required criteria to execute the test plan - e.g. preconditions, previous tests

DeviceUsage
type: Class
comment: A record of a device being used by a patient where the record is the result of a report from the patient or a clinician.
subclass of: DomainResource
subclass of: workflow.order
subclass of: Restriction
  max cardinality: 1
  on property: adherence
subclass of: Restriction
  max cardinality: 1
  on property: bodySite
subclass of: Restriction
  all values from: Reference
  on property: context
subclass of: Restriction
  all values from: code
  on property: status
subclass of: Restriction
  max cardinality: 1
  on property: usageStatus
subclass of: Restriction
  max cardinality: 1
  on property: dateAsserted
subclass of: Restriction
  cardinality: 1
  on property: device
subclass of: Restriction
  all values from: CodeableConcept
  on property: usageStatus
subclass of: Restriction
  all values from: CodeableReference
  on property: device
subclass of: Restriction
  all values from: Reference
  on property: patient
subclass of:
  union of: Restriction
    all values from: Timing
    on property: timing
  union of: Restriction
    max cardinality: 1
    on property: timing
  union of: Restriction
    all values from: Period
    on property: timing
  union of: Restriction
    max cardinality: 1
    on property: timing
  union of: Restriction
    all values from: dateTime
    on property: timing
  union of: Restriction
    max cardinality: 1
    on property: timing
subclass of: Restriction
  max cardinality: 1
  on property: context
subclass of: Restriction
  all values from: dateTime
  on property: dateAsserted
subclass of: Restriction
  all values from: Annotation
  on property: note
subclass of: Restriction
  all values from: CodeableReference
  on property: bodySite
subclass of: Restriction
  all values from: CodeableConcept
  on property: usageReason
subclass of: Restriction
  max cardinality: 1
  on property: informationSource
subclass of: Restriction
  all values from: Reference
  on property: derivedFrom
subclass of: Restriction
  all values from: Identifier
  on property: identifier
subclass of: Restriction
  all values from: CodeableReference
  on property: reason
subclass of: Restriction
  cardinality: 1
  on property: status
subclass of: Restriction
  cardinality: 1
  on property: patient
subclass of: Restriction
  all values from: Reference
  on property: basedOn
subclass of: Restriction
  all values from: DeviceUsageAdherenceComponent
  on property: adherence
subclass of: Restriction
  all values from: CodeableConcept
  on property: category
subclass of: Restriction
  all values from: Reference
  on property: informationSource
modifierExtensionClass: DeviceUsage

sent
type: ObjectProperty
comment: Communication.sent: The time when this communication was sent.
sub property of: when.done
modifierExtensionProperty: sent
title: Communication.sent: When sent

_associatedMedication
type: ObjectProperty
comment: (Modified) MedicationKnowledge.associatedMedication

ParametersParameterComponentParameter
type: Class
comment: A named part of a multi-part parameter.
subclass of: BackboneElement
subclass of: Restriction
  max cardinality: 1
  on property: value
subclass of: Restriction
  all values from: Resource
  on property: resource
subclass of: Restriction
  all values from: Element
  on property: value
subclass of: Restriction
  max cardinality: 1
  on property: resource
subclass of: Restriction
  cardinality: 1
  on property: name
subclass of: Restriction
  all values from: ParametersParameterComponentParameterParameter
  on property: part
subclass of: Restriction
  all values from: string
  on property: name
title: Named part of a multi-part parameter

executionPeriod
type: ObjectProperty
comment: Task.executionPeriod: Identifies the time action was first taken against the task (start) and/or the time final action was taken against the task prior to marking it as completed (end).
sub property of: when.done
modifierExtensionProperty: executionPeriod
title: Task.executionPeriod: Start and end time of execution

_custodian
type: ObjectProperty
comment: (Modified) DocumentReference.custodian
comment: (Modified) Composition.custodian
comment: (Modified) CarePlan.custodian
comment: (Modified) CapabilityStatement.implementation.custodian

specification
type: ObjectProperty
comment: DeviceDefinition.conformsTo.specification: Code that identifies the specific standard, specification, protocol, formal guidance, regulation, legislation, or certification scheme to which the device adheres.
comment: Device.conformsTo.specification: Code that identifies the specific standard, specification, protocol, formal guidance, regulation, legislation, or certification scheme to which the device adheres.
modifierExtensionProperty: specification
title: DeviceDefinition.conformsTo.specification: Identifies the standard, specification, or formal guidance that the device adheres to the Device Specification type
title: Device.conformsTo.specification: Identifies the standard, specification, or formal guidance that the device adheres to

HumanName
type: Class
comment: A name, normally of a human, that can be used for other living entities (e.g. animals but not organizations) that have been assigned names by a human and may need the use of name parts or the need for usage information.
subclass of: DataType
subclass of: Restriction
  all values from: string
  on property: text
subclass of: Restriction
  max cardinality: 1
  on property: use
subclass of: Restriction
  all values from: string
  on property: prefix
subclass of: Restriction
  all values from: string
  on property: given
subclass of: Restriction
  max cardinality: 1
  on property: text
subclass of: Restriction
  all values from: string
  on property: family
subclass of: Restriction
  all values from: Period
  on property: period
subclass of: Restriction
  max cardinality: 1
  on property: family
subclass of: Restriction
  max cardinality: 1
  on property: period
subclass of: Restriction
  all values from: code
  on property: use
subclass of: Restriction
  all values from: string
  on property: suffix
title: Name of a human or other living entity - parts and usage

ObservationDefinitionComponentComponentQualifiedValue
type: Class
comment: A set of qualified values associated with a context and a set of conditions - provides a range for quantitative and ordinal observations and a collection of value sets for qualitative observations.
subclass of: BackboneElement
subclass of: Restriction
  all values from: CodeableConcept
  on property: appliesTo
subclass of: Restriction
  all values from: canonical
  on property: abnormalCodedValueSet
subclass of: Restriction
  max cardinality: 1
  on property: normalCodedValueSet
subclass of: Restriction
  max cardinality: 1
  on property: range
subclass of: Restriction
  max cardinality: 1
  on property: condition
subclass of: Restriction
  all values from: CodeableConcept
  on property: context
subclass of: Restriction
  max cardinality: 1
  on property: abnormalCodedValueSet
subclass of: Restriction
  all values from: string
  on property: condition
subclass of: Restriction
  all values from: code
  on property: rangeCategory
subclass of: Restriction
  all values from: Range
  on property: age
subclass of: Restriction
  max cardinality: 1
  on property: age
subclass of: Restriction
  max cardinality: 1
  on property: context
subclass of: Restriction
  all values from: canonical
  on property: validCodedValueSet
subclass of: Restriction
  all values from: Range
  on property: range
subclass of: Restriction
  all values from: code
  on property: gender
subclass of: Restriction
  max cardinality: 1
  on property: gestationalAge
subclass of: Restriction
  all values from: Range
  on property: gestationalAge
subclass of: Restriction
  max cardinality: 1
  on property: criticalCodedValueSet
subclass of: Restriction
  all values from: canonical
  on property: criticalCodedValueSet
subclass of: Restriction
  max cardinality: 1
  on property: rangeCategory
subclass of: Restriction
  all values from: canonical
  on property: normalCodedValueSet
subclass of: Restriction
  max cardinality: 1
  on property: validCodedValueSet
subclass of: Restriction
  max cardinality: 1
  on property: gender
title: Set of qualified values for observation results

_searchInclude
type: ObjectProperty
comment: (Modified) CapabilityStatement.rest.resource.searchInclude

_technique
type: ObjectProperty
comment: (Modified) SubstanceDefinition.structure.technique
comment: (Modified) SubstanceDefinition.characterization.technique

legalStatusOfSupply
type: ObjectProperty
comment: PackagedProductDefinition.legalStatusOfSupply: The legal status of supply of the packaged item as classified by the regulator.
comment: MedicinalProductDefinition.legalStatusOfSupply: The legal status of supply of the medicinal product as classified by the regulator.
modifierExtensionProperty: _legalStatusOfSupply
title: PackagedProductDefinition.legalStatusOfSupply: The legal status of supply of the packaged item as classified by the regulator
title: MedicinalProductDefinition.legalStatusOfSupply: The legal status of supply of the medicinal product as classified by the regulator

short
type: ObjectProperty
comment: ElementDefinition.short: A concise description of what this element means (e.g. for use in autogenerated summaries).
modifierExtensionProperty: short
title: ElementDefinition.short: Concise definition for space-constrained presentation

generation
type: ObjectProperty
comment: ImplementationGuide.definition.page.page.generation: A code that indicates how the page is generated.
comment: ImplementationGuide.definition.page.generation: A code that indicates how the page is generated.
modifierExtensionProperty: _generation
title: ImplementationGuide.definition.page.page.generation: html | markdown | xml | generated
title: ImplementationGuide.definition.page.generation: html | markdown | xml | generated

doseAndRate
type: ObjectProperty
comment: Dosage.doseAndRate: Depending on the resource,this is the amount of medication administered, to be administered or typical amount to be administered.
modifierExtensionProperty: doseAndRate
title: Dosage.doseAndRate: Amount of medication administered, to be administered or typical amount to be administered

_condition
type: ObjectProperty
comment: (Modified) Account.diagnosis.condition
comment: (Modified) Specimen.condition
comment: (Modified) Encounter.diagnosis.condition
comment: (Modified) ChargeItemDefinition.propertyGroup.applicability.condition
comment: (Modified) ElementDefinition.condition
comment: (Modified) PlanDefinition.action.condition
comment: (Modified) PlanDefinition.action.action.condition
comment: (Modified) StructureMap.group.rule.rule.source.condition
comment: (Modified) RequestOrchestration.action.condition
comment: (Modified) FamilyMemberHistory.condition
comment: (Modified) ObservationDefinition.component.qualifiedValue.condition
comment: (Modified) RiskAssessment.condition
comment: (Modified) TriggerDefinition.condition
comment: (Modified) EpisodeOfCare.diagnosis.condition
comment: (Modified) StructureMap.group.rule.source.condition
comment: (Modified) RequestOrchestration.action.action.condition
comment: (Modified) Contract.term.group.asset.condition
comment: (Modified) ObservationDefinition.qualifiedValue.condition
comment: (Modified) ResearchStudy.condition
comment: (Modified) ChargeItemDefinition.applicability.condition
comment: (Modified) Contract.term.asset.condition

_followUp
type: ObjectProperty
comment: (Modified) Procedure.followUp

manufacturer
type: ObjectProperty
comment: PackagedProductDefinition.manufacturer: Manufacturer of this package type. When there are multiple it means these are all possible manufacturers.
comment: ManufacturedItemDefinition.manufacturer: Manufacturer of the item, one of several possible.
comment: SubstanceDefinition.manufacturer: The entity that creates, makes, produces or fabricates the substance. This is a set of potential manufacturers but is not necessarily comprehensive.
comment: Device.manufacturer: A name of the manufacturer or entity legally responsible for the device.
comment: PackagedProductDefinition.packaging.packaging.manufacturer: Manufacturer of this packaging item. When there are multiple values each one is a potential manufacturer of this packaging item.
comment: PackagedProductDefinition.packaging.manufacturer: Manufacturer of this packaging item. When there are multiple values each one is a potential manufacturer of this packaging item.
comment: Ingredient.manufacturer: The organization(s) that manufacture this ingredient. Can be used to indicate: 1) Organizations we are aware of that manufacture this ingredient 2) Specific Manufacturer(s) currently being used 3) Set of organisations allowed to manufacture this ingredient for this product Users must be clear on the application of context relevant to their use case.
comment: Immunization.manufacturer: Name of vaccine manufacturer.
comment: Ingredient.manufacturer.manufacturer: An organization that manufactures this ingredient.
comment: DeviceDefinition.manufacturer: A name of the manufacturer or legal representative e.g. labeler. Whether this is the actual manufacturer or the labeler or responsible depends on implementation and jurisdiction.
comment: NutritionProduct.manufacturer: The organisation (manufacturer, representative or legal authorization holder) that is responsible for the device.
sub property of: what
modifierExtensionProperty: manufacturer
title: ManufacturedItemDefinition.manufacturer: Manufacturer of the item, one of several possible
title: Ingredient.manufacturer.manufacturer: An organization that manufactures this ingredient
title: Immunization.manufacturer: Vaccine manufacturer
title: SubstanceDefinition.manufacturer: The entity that creates, makes, produces or fabricates the substance
title: DeviceDefinition.manufacturer: Name of device manufacturer
title: PackagedProductDefinition.packaging.packaging.manufacturer: Manufacturer of this packaging item (multiple means these are all potential manufacturers)
title: NutritionProduct.manufacturer: Manufacturer, representative or officially responsible for the product
title: Ingredient.manufacturer: An organization that manufactures this ingredient
title: Device.manufacturer: Name of device manufacturer
title: PackagedProductDefinition.packaging.manufacturer: Manufacturer of this packaging item (multiple means these are all potential manufacturers)
title: PackagedProductDefinition.manufacturer: Manufacturer of this package type (multiple means these are all possible manufacturers)

BiologicallyDerivedProductDispense
type: Class
comment: A record of dispensation of a biologically derived product.
subclass of: administrative.device
subclass of: DomainResource
subclass of: Restriction
  max cardinality: 1
  on property: originRelationshipType
subclass of: Restriction
  cardinality: 1
  on property: product
subclass of: Restriction
  all values from: Annotation
  on property: note
subclass of: Restriction
  all values from: Reference
  on property: destination
subclass of: Restriction
  all values from: CodeableConcept
  on property: matchStatus
subclass of: Restriction
  max cardinality: 1
  on property: usageInstruction
subclass of: Restriction
  all values from: code
  on property: status
subclass of: Restriction
  max cardinality: 1
  on property: destination
subclass of: Restriction
  all values from: SimpleQuantity
  on property: quantity
subclass of: Restriction
  all values from: CodeableConcept
  on property: originRelationshipType
subclass of: Restriction
  max cardinality: 1
  on property: whenHandedOver
subclass of: Restriction
  all values from: BiologicallyDerivedProductDispensePerformerComponent
  on property: performer
subclass of: Restriction
  all values from: string
  on property: usageInstruction
subclass of: Restriction
  max cardinality: 1
  on property: matchStatus
subclass of: Restriction
  max cardinality: 1
  on property: location
subclass of: Restriction
  all values from: Identifier
  on property: identifier
subclass of: Restriction
  max cardinality: 1
  on property: quantity
subclass of: Restriction
  all values from: Reference
  on property: patient
subclass of: Restriction
  cardinality: 1
  on property: patient
subclass of: Restriction
  max cardinality: 1
  on property: preparedDate
subclass of: Restriction
  all values from: Reference
  on property: basedOn
subclass of: Restriction
  cardinality: 1
  on property: status
subclass of: Restriction
  all values from: Reference
  on property: partOf
subclass of: Restriction
  all values from: dateTime
  on property: whenHandedOver
subclass of: Restriction
  all values from: Reference
  on property: location
subclass of: Restriction
  all values from: dateTime
  on property: preparedDate
subclass of: Restriction
  all values from: Reference
  on property: product
modifierExtensionClass: _BiologicallyDerivedProductDispense

_seriesUid
type: ObjectProperty
comment: (Modified) ImagingSelection.seriesUid

relatesTo
type: ObjectProperty
comment: Citation.citedArtifact.relatesTo: The artifact related to the cited artifact.
comment: DocumentReference.relatesTo: Relationships that this document has with other document references that already exist.
comment: Composition.relatesTo: Relationships that this composition has with other compositions or documents that already exist.
comment: EvidenceReport.relatesTo: Relationships that this composition has with other compositions or documents that already exist.
modifierExtensionProperty: _relatesTo
title: EvidenceReport.relatesTo: Relationships to other compositions/documents
title: Citation.citedArtifact.relatesTo: The artifact related to the cited artifact
title: Composition.relatesTo: Relationships to other compositions/documents
title: DocumentReference.relatesTo: Relationships to other documents

temperatureQualifier
type: ObjectProperty
comment: SpecimenDefinition.typeTested.handling.temperatureQualifier: It qualifies the interval of temperature, which characterizes an occurrence of handling. Conditions that are not related to temperature may be handled in the instruction element.
modifierExtensionProperty: temperatureQualifier
title: SpecimenDefinition.typeTested.handling.temperatureQualifier: Qualifies the interval of temperature

_PackagedProductDefinition
type: Class
comment: (Modified) PackagedProductDefinition
subclass of: DomainResource

_correspondingContact
type: ObjectProperty
comment: (Modified) Citation.citedArtifact.contributorship.entry.correspondingContact

citeAs
type: ObjectProperty
comment: EvidenceReport.citeAs
comment: Evidence.citeAs
comment: ArtifactAssessment.citeAs
modifierExtensionProperty: citeAs

_DeviceAssociation
type: Class
comment: (Modified) DeviceAssociation
subclass of: DomainResource

requireBoth
type: ObjectProperty
comment: SubscriptionTopic.resourceTrigger.queryCriteria.requireBoth: If set to `true`, both the `current` and `previous` query criteria must evaluate `true` to trigger a notification for this topic. If set to `false` or not present, a notification for this topic will be triggered if either the `current` or `previous` tests evaluate to `true`.
modifierExtensionProperty: requireBoth
title: SubscriptionTopic.resourceTrigger.queryCriteria.requireBoth: Both must be true flag

provisionData
type: Class
comment: Consent.provision.provisionData: The resources controlled by this provision if specific resources are referenced.
comment: Consent.provisionProvision.provisionData: The resources controlled by this provision if specific resources are referenced.
subclass of: BackboneElement
subclass of: Restriction
  all values from: code
  on property: meaning
subclass of: Restriction
  cardinality: 1
  on property: meaning
subclass of: Restriction
  cardinality: 1
  on property: reference
subclass of: Restriction
  all values from: Reference
  on property: reference
subclass of: Restriction
  all values from: Reference
  on property: reference
subclass of: Restriction
  cardinality: 1
  on property: reference
subclass of: Restriction
  all values from: code
  on property: meaning
subclass of: Restriction
  cardinality: 1
  on property: meaning

_characterization
type: ObjectProperty
comment: (Modified) SubstanceDefinition.characterization

criticality
type: ObjectProperty
comment: AllergyIntolerance.criticality: Estimate of the potential clinical harm, or seriousness, of the reaction to the identified substance.
sub property of: grade
modifierExtensionProperty: criticality
title: AllergyIntolerance.criticality: low | high | unable-to-assess

ConditionDefinitionPlanComponent
type: Class
comment: ConditionDefinitionPlanComponent: Plan that is appropriate.
subclass of: BackboneElement
subclass of: Restriction
  cardinality: 1
  on property: reference
subclass of: Restriction
  all values from: Reference
  on property: reference
subclass of: Restriction
  max cardinality: 1
  on property: role
subclass of: Restriction
  all values from: CodeableConcept
  on property: role

canPushUpdates
type: ObjectProperty
comment: VerificationResult.primarySource.canPushUpdates: Ability of the primary source to push updates/alerts (yes; no; undetermined).
modifierExtensionProperty: _canPushUpdates
title: VerificationResult.primarySource.canPushUpdates: yes | no | undetermined

_nTerminalModificationId
type: ObjectProperty
comment: (Modified) SubstanceProtein.subunit.nTerminalModificationId

_regionsCalled
type: ObjectProperty
comment: (Modified) GenomicStudy.analysis.regionsCalled

TestPlanTestCaseTestRunComponent
type: Class
comment: TestPlanTestCaseComponent.TestPlanTestCaseTestRunComponent: The actual test to be executed.
subclass of: BackboneElement
subclass of: Restriction
  max cardinality: 1
  on property: script
subclass of: Restriction
  all values from: TestPlanTestCaseTestRunScriptComponent
  on property: script
subclass of: Restriction
  max cardinality: 1
  on property: narrative
subclass of: Restriction
  all values from: markdown
  on property: narrative

_productOrService
type: ObjectProperty
comment: (Modified) CoverageEligibilityRequest.item.productOrService
comment: (Modified) Claim.item.detail.subDetail.productOrService
comment: (Modified) ExplanationOfBenefit.addItem.productOrService
comment: (Modified) ClaimResponse.addItem.detail.subDetail.productOrService
comment: (Modified) CoverageEligibilityResponse.insurance.item.productOrService
comment: (Modified) ExplanationOfBenefit.item.detail.subDetail.productOrService
comment: (Modified) ExplanationOfBenefit.addItem.detail.productOrService
comment: (Modified) Claim.item.productOrService
comment: (Modified) ClaimResponse.addItem.productOrService
comment: (Modified) ExplanationOfBenefit.item.productOrService
comment: (Modified) Claim.item.detail.productOrService
comment: (Modified) ExplanationOfBenefit.addItem.detail.subDetail.productOrService
comment: (Modified) ClaimResponse.addItem.detail.productOrService
comment: (Modified) ExplanationOfBenefit.item.detail.productOrService

reviewOutcome
type: ObjectProperty
comment: ClaimResponse.addItem.reviewOutcome: The high-level results of the adjudication if adjudication has been performed.
comment: ClaimResponse.item.detail.reviewOutcome: The high-level results of the adjudication if adjudication has been performed.
comment: ClaimResponse.item.detail.subDetail.reviewOutcome: The high-level results of the adjudication if adjudication has been performed.
comment: ExplanationOfBenefit.item.reviewOutcome: The high-level results of the adjudication if adjudication has been performed.
comment: ExplanationOfBenefit.addItem.detail.reviewOutcome: The high-level results of the adjudication if adjudication has been performed.
comment: ExplanationOfBenefit.addItem.reviewOutcome: The high-level results of the adjudication if adjudication has been performed.
comment: ExplanationOfBenefit.item.detail.reviewOutcome: The high-level results of the adjudication if adjudication has been performed.
comment: ExplanationOfBenefit.item.detail.subDetail.reviewOutcome: The high-level results of the adjudication if adjudication has been performed.
comment: ClaimResponse.addItem.detail.reviewOutcome: The high-level results of the adjudication if adjudication has been performed.
comment: ClaimResponse.addItem.detail.subDetail.reviewOutcome: The high-level results of the adjudication if adjudication has been performed.
comment: ExplanationOfBenefit.addItem.detail.subDetail.reviewOutcome: The high-level results of the adjudication if adjudication has been performed.
comment: ClaimResponse.item.reviewOutcome: The high-level results of the adjudication if adjudication has been performed.
modifierExtensionProperty: _reviewOutcome
title: ClaimResponse.item.reviewOutcome: Adjudication results
title: ExplanationOfBenefit.item.detail.subDetail.reviewOutcome: Subdetail level adjudication results
title: ClaimResponse.addItem.detail.subDetail.reviewOutcome: Added items subdetail level adjudication results
title: ClaimResponse.item.detail.reviewOutcome: Detail level adjudication results
title: ExplanationOfBenefit.addItem.detail.reviewOutcome: Additem detail level adjudication results
title: ExplanationOfBenefit.item.reviewOutcome: Adjudication results
title: ExplanationOfBenefit.addItem.reviewOutcome: Additem level adjudication results
title: ClaimResponse.addItem.reviewOutcome: Added items adjudication results
title: ExplanationOfBenefit.item.detail.reviewOutcome: Detail level adjudication results
title: ExplanationOfBenefit.addItem.detail.subDetail.reviewOutcome: Additem subdetail level adjudication results
title: ClaimResponse.addItem.detail.reviewOutcome: Added items detail level adjudication results
title: ClaimResponse.item.detail.subDetail.reviewOutcome: Subdetail level adjudication results

maxDispense
type: ObjectProperty
comment: MedicationKnowledge.regulatory.maxDispense: The maximum number of units of the medication that can be dispensed in a period.
modifierExtensionProperty: maxDispense
title: MedicationKnowledge.regulatory.maxDispense: The maximum number of units of the medication that can be dispensed in a period

modifierExtensionProperty
type: AnnotationProperty
comment: has modifier extension property

filterDefinition
type: ObjectProperty
comment: SubscriptionTopic.canFilterBy.filterDefinition: Either the canonical URL to a search parameter (like "http://hl7.org/fhir/SearchParameter/encounter-patient") or the officially-defined URI for a shared filter concept (like "http://example.org/concepts/shared-common-event").
modifierExtensionProperty: filterDefinition
title: SubscriptionTopic.canFilterBy.filterDefinition: Canonical URL for a filterParameter definition

sourceAttachment
type: ObjectProperty
comment: Consent.sourceAttachment: The source on which this consent statement is based. The source might be a scanned original paper form.
modifierExtensionProperty: sourceAttachment
title: Consent.sourceAttachment: Source from which this consent is taken

provisionActor
type: Class
comment: Consent.provision.provisionActor: Who or what is controlled by this provision. Use group to identify a set of actors by some property they share (e.g. 'admitting officers').
comment: Consent.provisionProvision.provisionActor: Who or what is controlled by this provision. Use group to identify a set of actors by some property they share (e.g. 'admitting officers').
subclass of: BackboneElement
subclass of: Restriction
  all values from: CodeableConcept
  on property: role
subclass of: Restriction
  max cardinality: 1
  on property: reference
subclass of: Restriction
  all values from: Reference
  on property: reference
subclass of: Restriction
  max cardinality: 1
  on property: role
subclass of: Restriction
  max cardinality: 1
  on property: reference
subclass of: Restriction
  all values from: CodeableConcept
  on property: role
subclass of: Restriction
  all values from: Reference
  on property: reference
subclass of: Restriction
  max cardinality: 1
  on property: role

NamingSystem
type: Class
comment: A curated namespace that issues unique symbols within that namespace for the identification of concepts, people, devices, etc. Represents a "System" used within the Identifier and Coding data types.
subclass of: conformance.terminology
subclass of: MetadataResource
subclass of: Restriction
  cardinality: 1
  on property: status
subclass of: Restriction
  all values from: ContactDetail
  on property: author
subclass of: Restriction
  all values from: RelatedArtifact
  on property: relatedArtifact
subclass of: Restriction
  all values from: uri
  on property: url
subclass of: Restriction
  all values from: string
  on property: copyrightLabel
subclass of: Restriction
  all values from: markdown
  on property: description
subclass of: Restriction
  all values from: ContactDetail
  on property: endorser
subclass of: Restriction
  all values from: dateTime
  on property: date
subclass of: Restriction
  all values from: date
  on property: approvalDate
subclass of: Restriction
  all values from: CodeableConcept
  on property: type
subclass of: Restriction
  all values from: ContactDetail
  on property: editor
subclass of: Restriction
  all values from: string
  on property: name
subclass of: Restriction
  max cardinality: 1
  on property: copyright
subclass of: Restriction
  all values from: string
  on property: version
subclass of: Restriction
  max cardinality: 1
  on property: usage
subclass of:
  union of: Restriction
    all values from: string
    on property: versionAlgorithm
  union of: Restriction
    max cardinality: 1
    on property: versionAlgorithm
  union of: Restriction
    all values from: Coding
    on property: versionAlgorithm
  union of: Restriction
    max cardinality: 1
    on property: versionAlgorithm
subclass of: Restriction
  all values from: string
  on property: title
subclass of: Restriction
  cardinality: 1
  on property: date
subclass of: Restriction
  all values from: NamingSystemUniqueIdComponent
  on property: uniqueId
subclass of: Restriction
  all values from: markdown
  on property: copyright
subclass of: Restriction
  all values from: Identifier
  on property: identifier
subclass of: Restriction
  all values from: boolean
  on property: experimental
subclass of: Restriction
  max cardinality: 1
  on property: experimental
subclass of: Restriction
  all values from: date
  on property: lastReviewDate
subclass of: Restriction
  all values from: string
  on property: publisher
subclass of: Restriction
  all values from: code
  on property: kind
subclass of: Restriction
  all values from: Period
  on property: effectivePeriod
subclass of: Restriction
  max cardinality: 1
  on property: type
subclass of: Restriction
  all values from: UsageContext
  on property: useContext
subclass of: Restriction
  max cardinality: 1
  on property: version
subclass of: Restriction
  max cardinality: 1
  on property: effectivePeriod
subclass of: Restriction
  max cardinality: 1
  on property: url
subclass of: Restriction
  all values from: code
  on property: status
subclass of: Restriction
  all values from: ContactDetail
  on property: contact
subclass of: Restriction
  all values from: string
  on property: usage
subclass of: Restriction
  max cardinality: 1
  on property: copyrightLabel
subclass of: Restriction
  cardinality: 1
  on property: kind
subclass of: Restriction
  cardinality: 1
  on property: name
subclass of: Restriction
  max cardinality: 1
  on property: purpose
subclass of: Restriction
  all values from: ContactDetail
  on property: reviewer
subclass of: Restriction
  max cardinality: 1
  on property: approvalDate
subclass of: Restriction
  all values from: CodeableConcept
  on property: jurisdiction
subclass of: Restriction
  max cardinality: 1
  on property: title
subclass of: Restriction
  all values from: CodeableConcept
  on property: topic
subclass of: Restriction
  all values from: string
  on property: responsible
subclass of: Restriction
  max cardinality: 1
  on property: lastReviewDate
subclass of: Restriction
  max cardinality: 1
  on property: responsible
subclass of: Restriction
  all values from: markdown
  on property: purpose
subclass of: Restriction
  max cardinality: 1
  on property: publisher
subclass of: Restriction
  min cardinality: 1
  on property: uniqueId
subclass of: Restriction
  max cardinality: 1
  on property: description

dateOfService
type: ObjectProperty
comment: Account.procedure.dateOfService: Date of the procedure when using a coded procedure. If using a reference to a procedure, then the date on the procedure should be used.
modifierExtensionProperty: _dateOfService
title: Account.procedure.dateOfService: Date of the procedure (when coded procedure)

VisionPrescription
type: Class
comment: An authorization for the provision of glasses and/or contact lenses to a patient.
subclass of: clinical.careprovision
subclass of: DomainResource
subclass of: Restriction
  cardinality: 1
  on property: created
subclass of: Restriction
  cardinality: 1
  on property: status
subclass of: Restriction
  cardinality: 1
  on property: dateWritten
subclass of: Restriction
  cardinality: 1
  on property: patient
subclass of: Restriction
  all values from: code
  on property: status
subclass of: Restriction
  all values from: Identifier
  on property: identifier
subclass of: Restriction
  all values from: VisionPrescriptionLensSpecificationComponent
  on property: lensSpecification
subclass of: Restriction
  all values from: dateTime
  on property: dateWritten
subclass of: Restriction
  all values from: Reference
  on property: prescriber
subclass of: Restriction
  min cardinality: 1
  on property: lensSpecification
subclass of: Restriction
  all values from: Reference
  on property: patient
subclass of: Restriction
  cardinality: 1
  on property: prescriber
subclass of: Restriction
  max cardinality: 1
  on property: encounter
subclass of: Restriction
  all values from: dateTime
  on property: created
subclass of: Restriction
  all values from: Reference
  on property: encounter
modifierExtensionClass: VisionPrescription

_unitPrice
type: ObjectProperty
comment: (Modified) Claim.item.unitPrice
comment: (Modified) ClaimResponse.addItem.unitPrice
comment: (Modified) ExplanationOfBenefit.item.detail.subDetail.unitPrice
comment: (Modified) Claim.item.detail.subDetail.unitPrice
comment: (Modified) ClaimResponse.addItem.detail.unitPrice
comment: (Modified) Contract.term.asset.valuedItem.unitPrice
comment: (Modified) ExplanationOfBenefit.addItem.unitPrice
comment: (Modified) Claim.item.detail.unitPrice
comment: (Modified) CoverageEligibilityRequest.item.unitPrice
comment: (Modified) ClaimResponse.addItem.detail.subDetail.unitPrice
comment: (Modified) ExplanationOfBenefit.item.unitPrice
comment: (Modified) ExplanationOfBenefit.item.detail.unitPrice
comment: (Modified) ExplanationOfBenefit.addItem.detail.subDetail.unitPrice
comment: (Modified) Contract.term.group.asset.valuedItem.unitPrice
comment: (Modified) ExplanationOfBenefit.addItem.detail.unitPrice

resource
type: ObjectProperty
comment: SubscriptionTopic.notificationShape.resource: URL of the Resource that is the type used in this shape. This is the 'focus' resource of the topic (or one of them if there are more than one) and the root resource for this shape definition. It will be the same, a generality, or a specificity of SubscriptionTopic.resourceTrigger.resource or SubscriptionTopic.eventTrigger.resource when they are present.
comment: TestScript.test.action.operation.resource: The type of the FHIR resource. See the [resource list](resourcelist.html). Data type of uri is needed when non-HL7 artifacts are identified.
comment: Permission.rule.data.resource: Explicit FHIR Resource references.
comment: ImplementationGuide.definition.resource: A resource that is part of the implementation guide. Conformance resources (value set, structure definition, capability statements etc.) are obvious candidates for inclusion, but any kind of resource can be included as an example resource.
comment: TestScript.fixture.resource: Reference to the resource (containing the contents of the resource needed for operations). This is allowed to be a Parameters resource.
comment: OperationDefinition.resource: The types on which this operation can be executed.
comment: Bundle.entry.resource: The Resource for the entry. The purpose/meaning of the resource is determined by the Bundle.type. This is allowed to be a Parameters resource if and only if it is referenced by something else within the Bundle that provides context/meaning.
comment: TestScript.setup.action.operation.resource: The type of the FHIR resource. See the [resource list](resourcelist.html). Data type of uri is needed when non-HL7 artifacts are identified.
comment: RelatedArtifact.resource: The related artifact, such as a library, value set, profile, or other knowledge resource.
comment: Parameters.parameter.resource: Conveys the content if the parameter is a whole resource.
comment: SubscriptionTopic.canFilterBy.resource: URL of the Resource that is the type used in this filter. This is the "focus" of the topic (or one of them if there are more than one). It will be the same, a generality, or a specificity of SubscriptionTopic.resourceTrigger.resource or SubscriptionTopic.eventTrigger.resource when they are present.
comment: RequestOrchestration.action.action.resource: The resource that is the target of the action (e.g. CommunicationRequest).
comment: Linkage.item.resource: The resource instance being linked as part of the group.
comment: SubscriptionTopic.resourceTrigger.resource: URL of the Resource that is the type used in this resource trigger. Relative URLs are relative to the StructureDefinition root of the implemented FHIR version (e.g., http://hl7.org/fhir/StructureDefinition). For example, "Patient" maps to http://hl7.org/fhir/StructureDefinition/Patient. For more information, see ElementDefinition.type.code.
comment: CapabilityStatement.rest.resource: A specification of the restful capabilities of the solution for a specific resource type.
comment: CompartmentDefinition.resource: Information about how a resource is related to the compartment.
comment: TestScript.test.action.assert.resource: The type of the resource. See the [resource list](resourcelist.html).
comment: EvidenceReport.relatesTo.target.resource: Target of the relationship Resource reference.
comment: ImplementationGuide.manifest.resource: A resource that is part of the implementation guide. Conformance resources (value set, structure definition, capability statements etc.) are obvious candidates for inclusion, but any kind of resource can be included as an example resource.
comment: Parameters.parameter.part.resource: Conveys the content if the parameter is a whole resource.
comment: TestScript.setup.action.assert.resource: The type of the resource. See the [resource list](resourcelist.html).
comment: Citation.citedArtifact.relatesTo.resource: The related artifact, such as a library, value set, profile, or other knowledge resource.
comment: TestScript.teardown.action.operation.resource: The type of the FHIR resource. See the [resource list](resourcelist.html). Data type of uri is needed when non-HL7 artifacts are identified.
comment: SubscriptionTopic.eventTrigger.resource: URL of the Resource that is the focus type used in this event trigger. Relative URLs are relative to the StructureDefinition root of the implemented FHIR version (e.g., http://hl7.org/fhir/StructureDefinition). For example, "Patient" maps to http://hl7.org/fhir/StructureDefinition/Patient. For more information, see ElementDefinition.type.code.
comment: RequestOrchestration.action.resource: The resource that is the target of the action (e.g. CommunicationRequest).
modifierExtensionProperty: resource
title: SubscriptionTopic.resourceTrigger.resource: Data Type or Resource (reference to definition) for this trigger definition
title: CapabilityStatement.rest.resource: Resource served on the REST interface
title: Permission.rule.data.resource: Explicit FHIR Resource references
title: OperationDefinition.resource: Types this operation applies to
title: CompartmentDefinition.resource: How a resource is related to the compartment
title: SubscriptionTopic.notificationShape.resource: URL of the Resource that is the focus (main) resource in a notification shape
title: Bundle.entry.resource: A resource in the bundle
title: Linkage.item.resource: Resource being linked
title: TestScript.teardown.action.operation.resource: Resource type
title: EvidenceReport.relatesTo.target.resource: Target of the relationship Resource reference
title: ImplementationGuide.manifest.resource: Resource in the implementation guide
title: TestScript.fixture.resource: Reference of the resource
title: ImplementationGuide.definition.resource: Resource in the implementation guide
title: TestScript.test.action.operation.resource: Resource type
title: SubscriptionTopic.canFilterBy.resource: URL of the triggering Resource that this filter applies to
title: Parameters.parameter.part.resource: If parameter is a whole resource
title: RequestOrchestration.action.action.resource: The target of the action
title: TestScript.setup.action.assert.resource: Resource type
title: TestScript.setup.action.operation.resource: Resource type
title: Citation.citedArtifact.relatesTo.resource: What artifact is being referenced
title: RequestOrchestration.action.resource: The target of the action
title: Parameters.parameter.resource: If parameter is a whole resource
title: TestScript.test.action.assert.resource: Resource type
title: SubscriptionTopic.eventTrigger.resource: Data Type or Resource (reference to definition) for this trigger definition
title: RelatedArtifact.resource: What artifact is being referenced

_response
type: ObjectProperty
comment: (Modified) TestScript.test.action.assert.response
comment: (Modified) TestScript.setup.action.assert.response
comment: (Modified) Bundle.entry.response
comment: (Modified) ExampleScenario.process.step.alternative.step.process.step.operation.response
comment: (Modified) MessageHeader.response
comment: (Modified) ExampleScenario.process.step.process.step.alternative.step.operation.response
comment: (Modified) ExampleScenario.process.step.process.step.operation.response
comment: (Modified) PaymentReconciliation.allocation.response
comment: (Modified) ExampleScenario.process.step.alternative.step.operation.response
comment: (Modified) ExampleScenario.process.step.operation.response
comment: (Modified) PaymentNotice.response

_agent
type: ObjectProperty
comment: (Modified) Provenance.entity.agent
comment: (Modified) Provenance.agent
comment: (Modified) AuditEvent.entity.agent
comment: (Modified) AuditEvent.agent

contraindicatedVaccineCode
type: ObjectProperty
comment: ImmunizationRecommendation.recommendation.contraindicatedVaccineCode: Vaccine(s) which should not be used to fulfill the recommendation.
modifierExtensionProperty: _contraindicatedVaccineCode
title: ImmunizationRecommendation.recommendation.contraindicatedVaccineCode: Vaccine which is contraindicated to fulfill the recommendation

ExampleScenarioProcessComponent.ExampleScenarioProcessStepComponent.ExampleScenarioProcessStepAlternativeComponentStepProcess
type: Class
comment: Indicates that the step is a complex sub-process with its own steps.
subclass of: BackboneElement
subclass of: Restriction
  all values from: string
  on property: title
subclass of: Restriction
  all values from: markdown
  on property: description
subclass of: Restriction
  max cardinality: 1
  on property: postConditions
subclass of: Restriction
  cardinality: 1
  on property: title
subclass of: Restriction
  all values from: ExampleScenarioProcessStepComponent
  on property: step
subclass of: Restriction
  max cardinality: 1
  on property: description
subclass of: Restriction
  all values from: markdown
  on property: preConditions
subclass of: Restriction
  all values from: markdown
  on property: postConditions
subclass of: Restriction
  max cardinality: 1
  on property: preConditions
title: Step is nested process

collector
type: ObjectProperty
comment: Specimen.collection.collector: Person who collected the specimen.
comment: BiologicallyDerivedProduct.collection.collector: Healthcare professional who is performing the collection.
sub property of: who.actor
modifierExtensionProperty: collector
title: Specimen.collection.collector: Who collected the specimen
title: BiologicallyDerivedProduct.collection.collector: Individual performing collection

enterer
type: ObjectProperty
comment: CoverageEligibilityRequest.enterer: Person who created the request.
comment: Claim.enterer: Individual who created the claim, predetermination or preauthorization.
comment: PaymentReconciliation.enterer: Payment enterer if not the actual payment issuer.
comment: ChargeItem.enterer: The device, practitioner, etc. who entered the charge item.
comment: ExplanationOfBenefit.enterer: Individual who created the claim, predetermination or preauthorization.
sub property of: who.actor
sub property of: who.author
modifierExtensionProperty: enterer
title: ExplanationOfBenefit.enterer: Author of the claim
title: ChargeItem.enterer: Individual who was entering
title: Claim.enterer: Author of the claim
title: CoverageEligibilityRequest.enterer: Author
title: PaymentReconciliation.enterer: Who entered the payment

_supportedInteraction
type: ObjectProperty
comment: (Modified) SubscriptionTopic.resourceTrigger.supportedInteraction

_differential
type: ObjectProperty
comment: (Modified) StructureDefinition.differential

_qualifiedValue
type: ObjectProperty
comment: (Modified) ObservationDefinition.component.qualifiedValue
comment: (Modified) ObservationDefinition.qualifiedValue

ManufacturedItemDefinitionComponentConstituentComponent
type: Class
comment: ManufacturedItemDefinitionComponentComponent.ManufacturedItemDefinitionComponentConstituentComponent: A reference to a constituent of the manufactured item as a whole, linked here so that its component location within the item can be indicated. This not where the item's ingredient are primarily stated (for which see Ingredient.for or ManufacturedItemDefinition.ingredient).
comment: ManufacturedItemDefinitionComponentComponentComponent.ManufacturedItemDefinitionComponentConstituentComponent: A reference to a constituent of the manufactured item as a whole, linked here so that its component location within the item can be indicated. This not where the item's ingredient are primarily stated (for which see Ingredient.for or ManufacturedItemDefinition.ingredient).
subclass of: BackboneElement
subclass of: Restriction
  all values from: CodeableConcept
  on property: function
subclass of: Restriction
  all values from: CodeableReference
  on property: hasIngredient
subclass of: Restriction
  all values from: CodeableConcept
  on property: function
subclass of: Restriction
  all values from: CodeableReference
  on property: hasIngredient
subclass of: Restriction
  all values from: CodeableConcept
  on property: location
subclass of: Restriction
  all values from: Quantity
  on property: amount
subclass of: Restriction
  all values from: Quantity
  on property: amount
subclass of: Restriction
  all values from: CodeableConcept
  on property: location

_additionalMonitoringIndicator
type: ObjectProperty
comment: (Modified) MedicinalProductDefinition.additionalMonitoringIndicator

_position
type: ObjectProperty
comment: (Modified) Location.position

limit
type: ObjectProperty
comment: Permission.rule.limit: What limits apply to the use of the data.
comment: InsurancePlan.coverage.benefit.limit: The specific limits on the benefit.
comment: DataRequirement.limit: Specifies a maximum number of results that are required (uses the _count search parameter).
modifierExtensionProperty: limit
title: Permission.rule.limit: What limits apply to the use of the data
title: InsurancePlan.coverage.benefit.limit: Benefit limits
title: DataRequirement.limit: Number of results

_reason
type: ObjectProperty
comment: (Modified) Appointment.reason
comment: (Modified) MedicationStatement.adherence.reason
comment: (Modified) CareTeam.reason
comment: (Modified) Transport.reason
comment: (Modified) ExplanationOfBenefit.addItem.detail.adjudication.reason
comment: (Modified) ImplementationGuide.dependsOn.reason
comment: (Modified) ClaimResponse.addItem.detail.reviewOutcome.reason
comment: (Modified) ClaimResponse.addItem.adjudication.reason
comment: (Modified) ClaimResponse.addItem.detail.subDetail.adjudication.reason
comment: (Modified) ExplanationOfBenefit.item.reviewOutcome.reason
comment: (Modified) Encounter.reason
comment: (Modified) PlanDefinition.action.action.reason
comment: (Modified) Immunization.reason
comment: (Modified) Communication.reason
comment: (Modified) Claim.supportingInfo.reason
comment: (Modified) CommunicationRequest.reason
comment: (Modified) MedicationRequest.substitution.reason
comment: (Modified) Observation.triggeredBy.reason
comment: (Modified) ClaimResponse.item.adjudication.reason
comment: (Modified) SupplyRequest.reason
comment: (Modified) GenomicStudy.reason
comment: (Modified) ResearchSubject.progress.reason
comment: (Modified) ExplanationOfBenefit.item.detail.subDetail.reviewOutcome.reason
comment: (Modified) ImagingStudy.reason
comment: (Modified) FamilyMemberHistory.reason
comment: (Modified) ClaimResponse.adjudication.reason
comment: (Modified) Contract.term.group.action.reason
comment: (Modified) EpisodeOfCare.reason
comment: (Modified) ExplanationOfBenefit.addItem.detail.subDetail.adjudication.reason
comment: (Modified) PlanDefinition.action.reason
comment: (Modified) NutritionIntake.reason
comment: (Modified) MessageHeader.reason
comment: (Modified) DeviceUsage.adherence.reason
comment: (Modified) DeviceUsage.reason
comment: (Modified) ExplanationOfBenefit.item.detail.subDetail.adjudication.reason
comment: (Modified) MedicationDispense.substitution.reason
comment: (Modified) ExplanationOfBenefit.adjudication.reason
comment: (Modified) ChargeItem.reason
comment: (Modified) Subscription.reason
comment: (Modified) RequestOrchestration.reason
comment: (Modified) ClaimResponse.item.detail.reviewOutcome.reason
comment: (Modified) DeviceRequest.reason
comment: (Modified) MedicationAdministration.reason
comment: (Modified) ClaimResponse.item.detail.subDetail.reviewOutcome.reason
comment: (Modified) ClaimResponse.addItem.detail.subDetail.reviewOutcome.reason
comment: (Modified) ClaimResponse.item.detail.adjudication.reason
comment: (Modified) ExplanationOfBenefit.addItem.detail.reviewOutcome.reason
comment: (Modified) ExplanationOfBenefit.addItem.detail.subDetail.reviewOutcome.reason
comment: (Modified) RiskAssessment.reason
comment: (Modified) MedicationRequest.reason
comment: (Modified) Procedure.reason
comment: (Modified) ExplanationOfBenefit.item.detail.adjudication.reason
comment: (Modified) MedicationStatement.reason
comment: (Modified) ClaimResponse.addItem.detail.adjudication.reason
comment: (Modified) ClaimResponse.addItem.reviewOutcome.reason
comment: (Modified) Task.reason
comment: (Modified) GuidanceResponse.reason
comment: (Modified) ExplanationOfBenefit.addItem.reviewOutcome.reason
comment: (Modified) ExplanationOfBenefit.item.detail.reviewOutcome.reason
comment: (Modified) ServiceRequest.reason
comment: (Modified) ExplanationOfBenefit.addItem.adjudication.reason
comment: (Modified) ExplanationOfBenefit.supportingInfo.reason
comment: (Modified) Contract.term.action.reason
comment: (Modified) ClaimResponse.item.reviewOutcome.reason
comment: (Modified) ExplanationOfBenefit.item.adjudication.reason
comment: (Modified) ClaimResponse.item.detail.subDetail.adjudication.reason

_planningHorizon
type: ObjectProperty
comment: (Modified) Schedule.planningHorizon

_safety
type: ObjectProperty
comment: (Modified) DeviceDefinition.safety
comment: (Modified) Device.safety

Identifier
type: Class
comment: An identifier - identifies some entity uniquely and unambiguously. Typically this is used for business identifiers.
subclass of: DataType
subclass of: Restriction
  all values from: Reference
  on property: assigner
subclass of: Restriction
  max cardinality: 1
  on property: assigner
subclass of: Restriction
  all values from: code
  on property: use
subclass of: Restriction
  max cardinality: 1
  on property: period
subclass of: Restriction
  all values from: Period
  on property: period
subclass of: Restriction
  all values from: string
  on property: value
subclass of: Restriction
  max cardinality: 1
  on property: system
subclass of: Restriction
  all values from: CodeableConcept
  on property: type
subclass of: Restriction
  max cardinality: 1
  on property: value
subclass of: Restriction
  max cardinality: 1
  on property: type
subclass of: Restriction
  max cardinality: 1
  on property: use
subclass of: Restriction
  all values from: uri
  on property: system
title: An identifier intended for computation

_mitigation
type: ObjectProperty
comment: (Modified) RiskAssessment.mitigation
comment: (Modified) DetectedIssue.mitigation

_specialCourtesy
type: ObjectProperty
comment: (Modified) Encounter.specialCourtesy

ExampleScenarioInstanceContainedInstanceComponent
type: Class
comment: ExampleScenarioInstanceComponent.ExampleScenarioInstanceContainedInstanceComponent: References to other instances that can be found within this instance (e.g. the observations contained in a bundle).
subclass of: BackboneElement
subclass of: Restriction
  max cardinality: 1
  on property: versionReference
subclass of: Restriction
  all values from: string
  on property: versionReference
subclass of: Restriction
  cardinality: 1
  on property: instanceReference
subclass of: Restriction
  all values from: string
  on property: instanceReference

edit
type: ObjectProperty
comment: MolecularSequence.relative.edit: Changes in sequence from the starting sequence.
modifierExtensionProperty: edit
title: MolecularSequence.relative.edit: Changes in sequence from the starting sequence

qualitativeRisk
type: ObjectProperty
comment: RiskAssessment.prediction.qualitativeRisk: Indicates how likely the outcome is (in the specified timeframe), expressed as a qualitative value (e.g. low, medium, or high).
modifierExtensionProperty: qualitativeRisk
title: RiskAssessment.prediction.qualitativeRisk: Likelihood of specified outcome as a qualitative value

immunizationEvent
type: ObjectProperty
comment: ImmunizationEvaluation.immunizationEvent: The vaccine administration event being evaluated.
modifierExtensionProperty: immunizationEvent
title: ImmunizationEvaluation.immunizationEvent: Immunization being evaluated

reference
type: ObjectProperty
comment: Contract.term.offer.party.reference: Participant in the offer.
comment: Claim.related.reference: An alternate organizational reference to the case or file to which this particular claim pertains.
comment: Consent.provision.provision.data.reference: A reference to a specific resource that defines which resources are covered by this consent.
comment: Reference.reference: A reference to a location at which the other resource is found. The reference may be a relative reference, in which case it is relative to the service base URL, or an absolute URL that resolves to the location where the resource is found. The reference may be version specific or not. If the reference is not to a FHIR RESTful server, then it should be assumed to be version specific. Internal fragment references (start with '#') refer to contained resources.
comment: DetectedIssue.reference: The literature, knowledge-base or similar reference that describes the propensity for the detected issue identified.
comment: MedicationKnowledge.storageGuideline.reference: Reference to additional information about the storage guidelines.
comment: CodeableReference.reference: A reference to a resource the provides exact details about the information being referenced.
comment: Contract.term.action.subject.reference: The entity the action is performed or not performed on or for.
comment: Consent.provision.provision.actor.reference: The resource that identifies the actor. To identify actors by type, use group to identify a set of actors by some property they share (e.g. 'admitting officers').
comment: Contract.term.group.offer.party.reference: Participant in the offer.
comment: Permission.rule.data.resource.reference: A reference to a specific resource that defines which resources are covered by this consent.
comment: ExplanationOfBenefit.related.reference: An alternate organizational reference to the case or file to which this particular claim pertains.
comment: Expression.reference: A URI that defines where the expression is found.
comment: ConditionDefinition.questionnaire.reference: Specific Questionnaire.
comment: Requirements.reference: A reference to another artifact that created this set of requirements. This could be a Profile, etc., or external regulation, or business requirements expressed elsewhere.
comment: Contract.term.group.asset.context.reference: Asset context reference may include the creator, custodian, or owning Person or Organization (e.g., bank, repository), location held, e.g., building, jurisdiction.
comment: ActorDefinition.reference: A reference to additional documentation about the actor, but description and documentation.
comment: ImplementationGuide.manifest.resource.reference: Where this resource is found.
comment: Consent.provision.actor.reference: The resource that identifies the actor. To identify actors by type, use group to identify a set of actors by some property they share (e.g. 'admitting officers').
comment: DeviceDefinition.hasPart.reference: Reference to the device that is part of the current device.
comment: Consent.provision.data.reference: A reference to a specific resource that defines which resources are covered by this consent.
comment: MedicationKnowledge.relatedMedicationKnowledge.reference: Associated documentation about the associated medication knowledge.
comment: Contract.term.group.action.subject.reference: The entity the action is performed or not performed on or for.
comment: DiagnosticReport.supportingInfo.reference: The reference for the supporting information in the diagnostic report.
comment: Consent.policyBasis.reference: A Reference that identifies the policy the organization will enforce for this Consent.
comment: Contract.term.asset.context.reference: Asset context reference may include the creator, custodian, or owning Person or Organization (e.g., bank, repository), location held, e.g., building, jurisdiction.
comment: ConditionDefinition.plan.reference: The actual plan.
comment: Requirements.statement.reference: A reference to another artifact that created this requirement. This could be a Profile, etc., or external regulation, or business requirements expressed elsewhere.
comment: ResearchStudy.outcomeMeasure.reference: Structured outcome definition.
comment: ImplementationGuide.definition.resource.reference: Where this resource is found.
modifierExtensionProperty: _reference
title: ConditionDefinition.questionnaire.reference: Specific Questionnaire
title: Consent.provision.provision.data.reference: The actual data reference
title: CodeableReference.reference: Reference to a resource (by instance)
title: Requirements.statement.reference: External artifact (rule/document etc. that) created this requirement
title: ResearchStudy.outcomeMeasure.reference: Structured outcome definition
title: DetectedIssue.reference: Authority for issue
title: Permission.rule.data.resource.reference: The actual data reference
title: Expression.reference: Where the expression is found
title: Claim.related.reference: File or case reference
title: Consent.provision.actor.reference: Resource for the actor (or group, by role)
title: ActorDefinition.reference: Reference to more information about the actor
title: MedicationKnowledge.relatedMedicationKnowledge.reference: Associated documentation about the associated medication knowledge
title: Consent.policyBasis.reference: Reference backing policy resource
title: Contract.term.group.action.subject.reference: Entity of the action
title: Contract.term.group.offer.party.reference: Referenced entity
title: DiagnosticReport.supportingInfo.reference: Supporting information reference
title: Consent.provision.data.reference: The actual data reference
title: Requirements.reference: External artifact (rule/document etc. that) created this set of requirements
title: Contract.term.offer.party.reference: Referenced entity
title: Contract.term.asset.context.reference: Creator,custodian or owner
title: ExplanationOfBenefit.related.reference: File or case reference
title: Contract.term.group.asset.context.reference: Creator,custodian or owner
title: Contract.term.action.subject.reference: Entity of the action
title: ConditionDefinition.plan.reference: The actual plan
title: Reference.reference: Literal reference, Relative, internal or absolute URL
title: DeviceDefinition.hasPart.reference: Reference to the part
title: ImplementationGuide.manifest.resource.reference: Location of the resource
title: MedicationKnowledge.storageGuideline.reference: Reference to additional information
title: Consent.provision.provision.actor.reference: Resource for the actor (or group, by role)
title: ImplementationGuide.definition.resource.reference: Location of the resource

reporter
type: ObjectProperty
comment: MeasureReport.reporter: The individual or organization that is reporting the data.
comment: InventoryReport.reporter: Who submits the report.
comment: PaymentNotice.reporter: The party who reports the payment notice.
sub property of: who.source
modifierExtensionProperty: reporter
title: InventoryReport.reporter: Who submits the report
title: MeasureReport.reporter: Who is reporting the data
title: PaymentNotice.reporter: Responsible practitioner

BackboneElement
type: Class
comment: Base definition for all elements that are defined inside a resource - but not those in a data type.
subclass of: Element
subclass of: Restriction
  cardinality: 0
  on property: modifierExtension
subclass of: Restriction
  all values from: Extension
  on property: modifierExtension
title: Base for elements defined inside a resource

_hasMember
type: ObjectProperty
comment: (Modified) ObservationDefinition.hasMember
comment: (Modified) Observation.hasMember

Provenance
type: Class
comment: Provenance of a resource is a record that describes entities and processes involved in producing and delivering or otherwise influencing that resource. Provenance provides a critical foundation for assessing authenticity, enabling trust, and allowing reproducibility. Provenance assertions are a form of contextual metadata and can themselves become important records with their own provenance. Provenance statement indicates clinical significance in terms of confidence in authenticity, reliability, and trustworthiness, integrity, and stage in lifecycle (e.g. Document Completion - has the artifact been legally authenticated), all of which may impact security, privacy, and trust policies.
subclass of: DomainResource
subclass of: infrastructure.information
subclass of: Restriction
  all values from: uri
  on property: policy
subclass of: Restriction
  all values from: ProvenanceEntityComponent
  on property: entity
subclass of: Restriction
  min cardinality: 1
  on property: agent
subclass of: Restriction
  all values from: Reference
  on property: location
subclass of: Restriction
  min cardinality: 1
  on property: target
subclass of:
  union of: Restriction
    all values from: Period
    on property: occurred
  union of: Restriction
    max cardinality: 1
    on property: occurred
  union of: Restriction
    all values from: dateTime
    on property: occurred
  union of: Restriction
    max cardinality: 1
    on property: occurred
subclass of: Restriction
  max cardinality: 1
  on property: recorded
subclass of: Restriction
  all values from: CodeableReference
  on property: authorization
subclass of: Restriction
  all values from: Signature
  on property: signature
subclass of: Restriction
  max cardinality: 1
  on property: location
subclass of: Restriction
  max cardinality: 1
  on property: activity
subclass of: Restriction
  all values from: Reference
  on property: target
subclass of: Restriction
  all values from: ProvenanceAgentComponent
  on property: agent
subclass of: Restriction
  all values from: Reference
  on property: encounter
subclass of: Restriction
  all values from: instant
  on property: recorded
subclass of: Restriction
  max cardinality: 1
  on property: patient
subclass of: Restriction
  max cardinality: 1
  on property: encounter
subclass of: Restriction
  all values from: CodeableConcept
  on property: activity
subclass of: Restriction
  all values from: Reference
  on property: basedOn
subclass of: Restriction
  all values from: Reference
  on property: patient
modifierExtensionClass: _Provenance

reasonLinkId
type: ObjectProperty
comment: Contract.term.group.action.reasonLinkId: Id [identifier??] of the clause or question text related to the reason type or reference of this action in the referenced form or QuestionnaireResponse.
comment: Contract.term.action.reasonLinkId: Id [identifier??] of the clause or question text related to the reason type or reference of this action in the referenced form or QuestionnaireResponse.
modifierExtensionProperty: reasonLinkId
title: Contract.term.group.action.reasonLinkId: Pointer to specific item
title: Contract.term.action.reasonLinkId: Pointer to specific item

owner
type: ObjectProperty
comment: DeviceDefinition.owner: An organization that is responsible for the provision and ongoing maintenance of the device.
comment: Transport.owner: Individual organization or Device currently responsible for transport execution.
comment: Account.owner: Indicates the service area, hospital, department, etc. with responsibility for managing the Account.
comment: Device.owner: An organization that is responsible for the provision and ongoing maintenance of the device.
comment: Task.owner: Party responsible for managing task execution.
sub property of: who.actor
sub property of: who.source
modifierExtensionProperty: owner
title: DeviceDefinition.owner: Organization responsible for device
title: Transport.owner: Responsible individual
title: Device.owner: Organization responsible for device
title: Task.owner: Responsible individual
title: Account.owner: Entity managing the Account

_assignedComparisonGroup
type: ObjectProperty
comment: (Modified) ResearchSubject.assignedComparisonGroup

_Condition
type: Class
comment: (Modified) Condition
subclass of: DomainResource

ConsentPolicyBasisComponent
type: Class
comment: ConsentPolicyBasisComponent: A Reference or URL used to uniquely identify the policy the organization will enforce for this Consent. This Reference or URL should be specific to the version of the policy and should be dereferencable to a computable policy of some form.
subclass of: BackboneElement
subclass of: Restriction
  max cardinality: 1
  on property: url
subclass of: Restriction
  all values from: url
  on property: url
subclass of: Restriction
  max cardinality: 1
  on property: reference
subclass of: Restriction
  all values from: Reference
  on property: reference

communicationMethod
type: ObjectProperty
comment: VerificationResult.attestation.communicationMethod: The method by which attested information was submitted/retrieved (manual; API; Push).
comment: VerificationResult.primarySource.communicationMethod: Method for communicating with the primary source (manual; API; Push).
modifierExtensionProperty: _communicationMethod
title: VerificationResult.attestation.communicationMethod: The method by which attested information was submitted/retrieved
title: VerificationResult.primarySource.communicationMethod: Method for exchanging information with the primary source

ClaimResponse.Item.ItemDetailReviewOutcome
type: Class
comment: The high-level results of the adjudication if adjudication has been performed.
subclass of: BackboneElement
subclass of: Restriction
  max cardinality: 1
  on property: decision
subclass of: Restriction
  all values from: CodeableConcept
  on property: decision
subclass of: Restriction
  all values from: string
  on property: preAuthRef
subclass of: Restriction
  all values from: Period
  on property: preAuthPeriod
subclass of: Restriction
  max cardinality: 1
  on property: preAuthPeriod
subclass of: Restriction
  all values from: CodeableConcept
  on property: reason
subclass of: Restriction
  max cardinality: 1
  on property: preAuthRef
title: Detail level adjudication results

_param
type: ObjectProperty
comment: (Modified) CompartmentDefinition.resource.param

_power
type: ObjectProperty
comment: (Modified) VisionPrescription.lensSpecification.power

_issue
type: ObjectProperty
comment: (Modified) OperationOutcome.issue
comment: (Modified) Citation.citedArtifact.publicationForm.issue

concept
type: ObjectProperty
comment: CodeSystem.concept.concept.concept: Defines children of a concept to produce a hierarchy of concepts. The nature of the relationships is variable (is-a/contains/categorizes) - see hierarchyMeaning.
comment: CodeableReference.concept: A reference to a concept - e.g. the information is identified by its general class to the degree of precision found in the terminology.
comment: CodeSystem.concept.concept: Defines children of a concept to produce a hierarchy of concepts. The nature of the relationships is variable (is-a/contains/categorizes) - see hierarchyMeaning.
comment: ValueSet.compose.exclude.concept: Specifies a concept to be included or excluded.
comment: ValueSet.compose.include.concept: Specifies a concept to be included or excluded.
comment: CodeSystem.concept: Concepts that are in the code system. The concept definitions are inherently hierarchical, but the definitions must be consulted to determine what the meanings of the hierarchical relationships are.
modifierExtensionProperty: _concept
title: CodeSystem.concept: Concepts in the code system
title: ValueSet.compose.include.concept: A concept defined in the system
title: CodeableReference.concept: Reference to a concept (by class)
title: CodeSystem.concept.concept.concept: Child Concepts (is-a/contains/categorizes)
title: ValueSet.compose.exclude.concept: A concept defined in the system
title: CodeSystem.concept.concept: Child Concepts (is-a/contains/categorizes)

decisionMode
type: ObjectProperty
comment: Contract.term.group.offer.decisionMode: How the decision about a Contract was conveyed.
comment: Contract.term.offer.decisionMode: How the decision about a Contract was conveyed.
modifierExtensionProperty: decisionMode
title: Contract.term.group.offer.decisionMode: How decision is conveyed
title: Contract.term.offer.decisionMode: How decision is conveyed

instantiatesUri
type: ObjectProperty
comment: CarePlan.instantiatesUri: The URL pointing to an externally maintained protocol, guideline, questionnaire or other definition that is adhered to in whole or in part by this CarePlan.
comment: RequestOrchestration.instantiatesUri: A URL referencing an externally defined protocol, guideline, orderset or other definition that is adhered to in whole or in part by this request.
comment: DeviceRequest.instantiatesUri: The URL pointing to an externally maintained protocol, guideline, orderset or other definition that is adhered to in whole or in part by this DeviceRequest.
comment: Communication.instantiatesUri: The URL pointing to an externally maintained protocol, guideline, orderset or other definition that is adhered to in whole or in part by this Communication.
comment: FamilyMemberHistory.instantiatesUri: The URL pointing to an externally maintained protocol, guideline, orderset or other definition that is adhered to in whole or in part by this FamilyMemberHistory.
comment: Task.instantiatesUri: The URL pointing to an *externally* maintained protocol, guideline, orderset or other definition that is adhered to in whole or in part by this Task.
comment: Procedure.instantiatesUri: The URL pointing to an externally maintained protocol, guideline, order set or other definition that is adhered to in whole or in part by this Procedure.
comment: Transport.instantiatesUri: The URL pointing to an *externally* maintained protocol, guideline, orderset or other definition that is adhered to in whole or in part by this Transport.
comment: GenomicStudy.instantiatesUri: The URL pointing to an externally maintained protocol that describes the study.
comment: Contract.instantiatesUri: The URL pointing to an externally maintained definition that is adhered to in whole or in part by this Contract.
comment: NutritionIntake.instantiatesUri: Instantiates external protocol or definition.
comment: NutritionOrder.instantiatesUri: The URL pointing to an externally maintained protocol, guideline, orderset or other definition that is adhered to in whole or in part by this NutritionOrder.
comment: GenomicStudy.analysis.instantiatesUri: The URL pointing to an externally maintained protocol that describes the analysis.
comment: ServiceRequest.instantiatesUri: The URL pointing to an externally maintained protocol, guideline, orderset or other definition that is adhered to in whole or in part by this ServiceRequest.
modifierExtensionProperty: instantiatesUri
title: RequestOrchestration.instantiatesUri: Instantiates external protocol or definition
title: Transport.instantiatesUri: Formal definition of transport
title: Communication.instantiatesUri: Instantiates external protocol or definition
title: ServiceRequest.instantiatesUri: Instantiates external protocol or definition
title: DeviceRequest.instantiatesUri: Instantiates external protocol or definition
title: Task.instantiatesUri: Formal definition of task
title: NutritionIntake.instantiatesUri: Instantiates external protocol or definition
title: GenomicStudy.analysis.instantiatesUri: The URL pointing to an externally maintained protocol that describes the analysis
title: CarePlan.instantiatesUri: Instantiates external protocol or definition
title: Contract.instantiatesUri: External Contract Definition
title: Procedure.instantiatesUri: Instantiates external protocol or definition
title: FamilyMemberHistory.instantiatesUri: Instantiates external protocol or definition
title: NutritionOrder.instantiatesUri: Instantiates external protocol or definition
title: GenomicStudy.instantiatesUri: The URL pointing to an externally maintained protocol that describes the study

_ifMatch
type: ObjectProperty
comment: (Modified) Bundle.entry.request.ifMatch

sequenceType
type: ObjectProperty
comment: SubstanceProtein.sequenceType: The SubstanceProtein descriptive elements will only be used when a complete or partial amino acid sequence is available or derivable from a nucleic acid sequence.
comment: SubstanceNucleicAcid.sequenceType: The type of the sequence shall be specified based on a controlled vocabulary.
modifierExtensionProperty: sequenceType
title: SubstanceProtein.sequenceType: The SubstanceProtein descriptive elements will only be used when a complete or partial amino acid sequence is available or derivable from a nucleic acid sequence
title: SubstanceNucleicAcid.sequenceType: The type of the sequence shall be specified based on a controlled vocabulary

_fastingStatus
type: ObjectProperty
comment: (Modified) Specimen.collection.fastingStatus

preferredReportName
type: ObjectProperty
comment: ObservationDefinition.preferredReportName: The preferred name to be used when reporting the results of observations conforming to this ObservationDefinition.
modifierExtensionProperty: _preferredReportName
title: ObservationDefinition.preferredReportName: The preferred name to be used when reporting the observation results

_numberOfSeries
type: ObjectProperty
comment: (Modified) ImagingStudy.numberOfSeries

rankingOrder
type: ObjectProperty
comment: Citation.citedArtifact.contributorship.entry.rankingOrder: Provides a numerical ranking to represent the degree of contributorship relative to other contributors, such as 1 for first author and 2 for second author.
modifierExtensionProperty: rankingOrder
title: Citation.citedArtifact.contributorship.entry.rankingOrder: Ranked order of contribution

_currency
type: ObjectProperty
comment: (Modified) Account.currency
comment: (Modified) Money.currency

testTools
type: ObjectProperty
comment: TestPlan.testTools: A description of test tools to be used in the test plan.
modifierExtensionProperty: _testTools
title: TestPlan.testTools: A description of test tools to be used in the test plan - narrative for now

_warning
type: ObjectProperty
comment: (Modified) DeviceDefinition.guideline.warning
comment: (Modified) ClinicalUseDefinition.warning

CoverageEligibilityResponseEventComponent
type: Class
comment: CoverageEligibilityResponseEventComponent: Information code for an event with a corresponding date or period.
subclass of: BackboneElement
subclass of:
  union of: Restriction
    all values from: dateTime
    on property: when
  union of: Restriction
    cardinality: 1
    on property: when
  union of: Restriction
    all values from: Period
    on property: when
  union of: Restriction
    cardinality: 1
    on property: when
subclass of: Restriction
  cardinality: 1
  on property: type
subclass of: Restriction
  all values from: CodeableConcept
  on property: type

_characteristic
type: ObjectProperty
comment: (Modified) Group.characteristic
comment: (Modified) InventoryItem.characteristic
comment: (Modified) HealthcareService.characteristic
comment: (Modified) EvidenceReport.subject.characteristic
comment: (Modified) NutritionProduct.characteristic
comment: (Modified) EvidenceVariable.characteristic.definitionByCombination.characteristic.definitionByCombination.characteristic
comment: (Modified) EvidenceVariable.characteristic
comment: (Modified) Location.characteristic
comment: (Modified) PackagedProductDefinition.characteristic
comment: (Modified) PractitionerRole.characteristic
comment: (Modified) EvidenceVariable.characteristic.definitionByCombination.characteristic
comment: (Modified) MedicinalProductDefinition.characteristic

dataRequirement
type: ObjectProperty
comment: Library.dataRequirement: Describes a set of data that must be provided in order to be able to successfully perform the computations defined by the library.
comment: GuidanceResponse.dataRequirement: If the evaluation could not be completed due to lack of information, or additional information would potentially result in a more accurate response, this element will a description of the data required in order to proceed with the evaluation. A subsequent request to the service should include this data.
modifierExtensionProperty: dataRequirement
title: Library.dataRequirement: What data is referenced by this library
title: GuidanceResponse.dataRequirement: Additional required data

_domain
type: ObjectProperty
comment: (Modified) SubstanceDefinition.name.translation.domain
comment: (Modified) SubstanceDefinition.name.synonym.domain
comment: (Modified) SubstanceDefinition.name.domain
comment: (Modified) SubstanceDefinition.domain
comment: (Modified) MedicinalProductDefinition.domain
comment: (Modified) Contract.domain

InventoryReport
type: Class
comment: A report of inventory or stock items.
subclass of: administrative.entity
subclass of: DomainResource
subclass of: Restriction
  all values from: Identifier
  on property: identifier
subclass of: Restriction
  cardinality: 1
  on property: countType
subclass of: Restriction
  cardinality: 1
  on property: status
subclass of: Restriction
  max cardinality: 1
  on property: reporter
subclass of: Restriction
  all values from: Annotation
  on property: note
subclass of: Restriction
  max cardinality: 1
  on property: operationTypeReason
subclass of: Restriction
  cardinality: 1
  on property: reportedDateTime
subclass of: Restriction
  max cardinality: 1
  on property: reportingPeriod
subclass of: Restriction
  all values from: CodeableConcept
  on property: operationType
subclass of: Restriction
  all values from: InventoryReportInventoryListingComponent
  on property: inventoryListing
subclass of: Restriction
  max cardinality: 1
  on property: operationType
subclass of: Restriction
  all values from: code
  on property: status
subclass of: Restriction
  all values from: code
  on property: countType
subclass of: Restriction
  all values from: CodeableConcept
  on property: operationTypeReason
subclass of: Restriction
  all values from: Period
  on property: reportingPeriod
subclass of: Restriction
  all values from: Reference
  on property: reporter
subclass of: Restriction
  all values from: dateTime
  on property: reportedDateTime
modifierExtensionClass: InventoryReport

_parameterName
type: ObjectProperty
comment: (Modified) OperationDefinition.overload.parameterName

progressStatus
type: ObjectProperty
comment: ResearchStudy.progressStatus: Status of study with time for that status.
modifierExtensionProperty: _progressStatus
title: ResearchStudy.progressStatus: Status of study with time for that status

_narrative
type: ObjectProperty
comment: (Modified) TestPlan.testCase.testRun.narrative

ExplanationOfBenefit.AddedItem.AddedItemDetailReviewOutcome
type: Class
comment: The high-level results of the adjudication if adjudication has been performed.
subclass of: BackboneElement
subclass of: Restriction
  max cardinality: 1
  on property: decision
subclass of: Restriction
  max cardinality: 1
  on property: preAuthRef
subclass of: Restriction
  all values from: CodeableConcept
  on property: decision
subclass of: Restriction
  all values from: CodeableConcept
  on property: reason
subclass of: Restriction
  all values from: Period
  on property: preAuthPeriod
subclass of: Restriction
  all values from: string
  on property: preAuthRef
subclass of: Restriction
  max cardinality: 1
  on property: preAuthPeriod
title: Additem detail level adjudication results

Endpoint
type: Class
comment: The technical details of an endpoint that can be used for electronic services, such as for web services providing XDS.b, a REST endpoint for another FHIR server, or a s/Mime email address. This may include any security context information.
subclass of: DomainResource
subclass of: infrastructure.exchange
subclass of: Restriction
  all values from: string
  on property: description
subclass of: Restriction
  all values from: Identifier
  on property: identifier
subclass of: Restriction
  all values from: code
  on property: status
subclass of: Restriction
  all values from: CodeableConcept
  on property: environmentType
subclass of: Restriction
  max cardinality: 1
  on property: name
subclass of: Restriction
  min cardinality: 1
  on property: connectionType
subclass of: Restriction
  all values from: string
  on property: name
subclass of: Restriction
  all values from: Reference
  on property: managingOrganization
subclass of: Restriction
  all values from: EndpointPayloadComponent
  on property: payload
subclass of: Restriction
  all values from: CodeableConcept
  on property: connectionType
subclass of: Restriction
  all values from: string
  on property: header
subclass of: Restriction
  cardinality: 1
  on property: address
subclass of: Restriction
  cardinality: 1
  on property: status
subclass of: Restriction
  all values from: ContactPoint
  on property: contact
subclass of: Restriction
  all values from: Period
  on property: period
subclass of: Restriction
  max cardinality: 1
  on property: managingOrganization
subclass of: Restriction
  max cardinality: 1
  on property: description
subclass of: Restriction
  max cardinality: 1
  on property: period
subclass of: Restriction
  all values from: url
  on property: address
modifierExtensionClass: Endpoint

subjectState
type: ObjectProperty
comment: ResearchSubject.progress.subjectState: The current state of the subject.
sub property of: status
modifierExtensionProperty: subjectState
title: ResearchSubject.progress.subjectState: candidate | eligible | follow-up | ineligible | not-registered | off-study | on-study | on-study-intervention | on-study-observation | pending-on-study | potential-candidate | screening | withdrawn

EvidenceVariableCharacteristicComponent.EvidenceVariableCharacteristicDefinitionByCombinationComponentCharacteristic
type: Class
comment: A defining factor of the characteristic.
subclass of: BackboneElement
subclass of: Restriction
  all values from: id
  on property: linkId
subclass of: Restriction
  max cardinality: 1
  on property: definitionId
subclass of: Restriction
  max cardinality: 1
  on property: definitionReference
subclass of: Restriction
  all values from: markdown
  on property: description
subclass of: Restriction
  all values from: EvidenceVariableCharacteristicTimeFromEventComponent
  on property: timeFromEvent
subclass of: Restriction
  all values from: CodeableConcept
  on property: definitionCodeableConcept
subclass of: Restriction
  all values from: canonical
  on property: definitionCanonical
subclass of: Restriction
  all values from: id
  on property: definitionId
subclass of: Restriction
  max cardinality: 1
  on property: definitionCanonical
subclass of: Restriction
  all values from: Expression
  on property: definitionExpression
subclass of: Restriction
  max cardinality: 1
  on property: description
subclass of: Restriction
  max cardinality: 1
  on property: definitionByTypeAndValue
subclass of: Restriction
  all values from: EvidenceVariableCharacteristicDefinitionByCombinationComponent
  on property: definitionByCombination
subclass of: Restriction
  all values from: EvidenceVariableCharacteristicDefinitionByTypeAndValueComponent
  on property: definitionByTypeAndValue
subclass of: Restriction
  max cardinality: 1
  on property: definitionExpression
subclass of: Restriction
  all values from: boolean
  on property: exclude
subclass of: Restriction
  max cardinality: 1
  on property: linkId
subclass of: Restriction
  max cardinality: 1
  on property: definitionByCombination
subclass of: Restriction
  max cardinality: 1
  on property: definitionCodeableConcept
subclass of: Restriction
  all values from: Reference
  on property: definitionReference
subclass of: Restriction
  max cardinality: 1
  on property: exclude
subclass of:
  union of: Restriction
    all values from: Quantity
    on property: duration
  union of: Restriction
    max cardinality: 1
    on property: duration
  union of: Restriction
    all values from: Range
    on property: duration
  union of: Restriction
    max cardinality: 1
    on property: duration
subclass of: Restriction
  all values from: Annotation
  on property: note
subclass of:
  union of: Restriction
    all values from: Quantity
    on property: instances
  union of: Restriction
    max cardinality: 1
    on property: instances
  union of: Restriction
    all values from: Range
    on property: instances
  union of: Restriction
    max cardinality: 1
    on property: instances
title: A defining factor of the characteristic

entry
type: ObjectProperty
comment: Composition.section.entry: A reference to the actual resource from which the narrative in the section is derived.
comment: Bundle.entry: An entry in a bundle resource - will either contain a resource or information about a resource (transactions and history only).
comment: List.entry: Entries in this list.
comment: Citation.citedArtifact.contributorship.entry: An individual entity named as a contributor, for example in the author list or contributor list.
comment: Composition.section.section.entry: A reference to the actual resource from which the narrative in the section is derived.
modifierExtensionProperty: entry
title: Bundle.entry: Entry in the bundle - will have a resource or information
title: Composition.section.entry: A reference to data that supports this section
title: Citation.citedArtifact.contributorship.entry: An individual entity named as a contributor
title: List.entry: Entries in the list
title: Composition.section.section.entry: A reference to data that supports this section

_weeklyTemplate
type: ObjectProperty
comment: (Modified) Appointment.recurrenceTemplate.weeklyTemplate

what
type: ObjectProperty
comment: Provenance.entity.what: Identity of the Entity used. May be a logical or physical uri and maybe absolute or relative.
comment: AuditEvent.entity.what: Identifies a specific instance of the entity. The reference should be version specific. This is allowed to be a Parameters resource.
sub property of: what
modifierExtensionProperty: what
title: Provenance.entity.what: Identity of entity
title: AuditEvent.entity.what: Specific instance of resource

whenPrepared
type: ObjectProperty
comment: MedicationDispense.whenPrepared: The time when the dispensed product was packaged and reviewed.
modifierExtensionProperty: whenPrepared
title: MedicationDispense.whenPrepared: When product was packaged and reviewed

Action
type: Class
comment: Contract.TermTerm.Action: An actor taking a role in an activity for which it can be assigned some degree of responsibility for the activity taking place.
comment: Contract.Term.Action: An actor taking a role in an activity for which it can be assigned some degree of responsibility for the activity taking place.
subclass of: BackboneElement
subclass of:
  union of: Restriction
    all values from: dateTime
    on property: occurrence
  union of: Restriction
    max cardinality: 1
    on property: occurrence
  union of: Restriction
    all values from: Period
    on property: occurrence
  union of: Restriction
    max cardinality: 1
    on property: occurrence
  union of: Restriction
    all values from: Timing
    on property: occurrence
  union of: Restriction
    max cardinality: 1
    on property: occurrence
subclass of: Restriction
  cardinality: 1
  on property: type
subclass of: Restriction
  all values from: string
  on property: linkId
subclass of: Restriction
  max cardinality: 1
  on property: performerRole
subclass of: Restriction
  all values from: Reference
  on property: requester
subclass of: Restriction
  all values from: CodeableConcept
  on property: performerRole
subclass of: Restriction
  all values from: CodeableConcept
  on property: performerType
subclass of: Restriction
  max cardinality: 1
  on property: performerRole
subclass of: Restriction
  all values from: ActionSubject
  on property: subject
subclass of: Restriction
  all values from: string
  on property: requesterLinkId
subclass of: Restriction
  cardinality: 1
  on property: intent
subclass of: Restriction
  all values from: string
  on property: linkId
subclass of: Restriction
  all values from: CodeableConcept
  on property: status
subclass of: Restriction
  all values from: boolean
  on property: doNotPerform
subclass of: Restriction
  max cardinality: 1
  on property: performer
subclass of: Restriction
  cardinality: 1
  on property: type
subclass of: Restriction
  max cardinality: 1
  on property: doNotPerform
subclass of: Restriction
  all values from: string
  on property: performerLinkId
subclass of: Restriction
  all values from: CodeableReference
  on property: reason
subclass of:
  union of: Restriction
    all values from: dateTime
    on property: occurrence
  union of: Restriction
    max cardinality: 1
    on property: occurrence
  union of: Restriction
    all values from: Period
    on property: occurrence
  union of: Restriction
    max cardinality: 1
    on property: occurrence
  union of: Restriction
    all values from: Timing
    on property: occurrence
  union of: Restriction
    max cardinality: 1
    on property: occurrence
subclass of: Restriction
  all values from: CodeableConcept
  on property: performerRole
subclass of: Restriction
  all values from: Annotation
  on property: note
subclass of: Restriction
  all values from: CodeableConcept
  on property: status
subclass of: Restriction
  max cardinality: 1
  on property: doNotPerform
subclass of: Restriction
  all values from: Reference
  on property: performer
subclass of: Restriction
  all values from: CodeableConcept
  on property: type
subclass of: Restriction
  all values from: CodeableConcept
  on property: type
subclass of: Restriction
  max cardinality: 1
  on property: performer
subclass of: Restriction
  all values from: unsignedInt
  on property: securityLabelNumber
subclass of: Restriction
  all values from: string
  on property: contextLinkId
subclass of: Restriction
  all values from: boolean
  on property: doNotPerform
subclass of: Restriction
  all values from: string
  on property: performerLinkId
subclass of: Restriction
  all values from: unsignedInt
  on property: securityLabelNumber
subclass of: Restriction
  max cardinality: 1
  on property: context
subclass of: Restriction
  all values from: Annotation
  on property: note
subclass of: Restriction
  all values from: Reference
  on property: context
subclass of: Restriction
  all values from: Reference
  on property: performer
subclass of: Restriction
  all values from: CodeableConcept
  on property: intent
subclass of: Restriction
  all values from: CodeableReference
  on property: reason
subclass of: Restriction
  all values from: Reference
  on property: context
subclass of: Restriction
  cardinality: 1
  on property: intent
subclass of: Restriction
  cardinality: 1
  on property: status
subclass of: Restriction
  max cardinality: 1
  on property: context
subclass of: Restriction
  all values from: string
  on property: reasonLinkId
subclass of: Restriction
  all values from: Reference
  on property: requester
subclass of: Restriction
  all values from: CodeableConcept
  on property: intent
subclass of: Restriction
  all values from: ActionSubject
  on property: subject
subclass of: Restriction
  all values from: string
  on property: reasonLinkId
subclass of: Restriction
  all values from: string
  on property: contextLinkId
subclass of: Restriction
  all values from: string
  on property: requesterLinkId
subclass of: Restriction
  cardinality: 1
  on property: status
subclass of: Restriction
  all values from: CodeableConcept
  on property: performerType

_observationRequirement
type: ObjectProperty
comment: (Modified) ActivityDefinition.observationRequirement

focal
type: ObjectProperty
comment: ExplanationOfBenefit.insurance.focal: A flag to indicate that this Coverage is to be used for adjudication of this claim when set to true.
comment: CoverageEligibilityRequest.insurance.focal: A flag to indicate that this Coverage is to be used for evaluation of this request when set to true.
comment: ClaimResponse.insurance.focal: A flag to indicate that this Coverage is to be used for adjudication of this claim when set to true.
comment: Claim.insurance.focal: A flag to indicate that this Coverage is to be used for adjudication of this claim when set to true.
modifierExtensionProperty: focal
title: CoverageEligibilityRequest.insurance.focal: Applicable coverage
title: Claim.insurance.focal: Coverage to be used for adjudication
title: ClaimResponse.insurance.focal: Coverage to be used for adjudication
title: ExplanationOfBenefit.insurance.focal: Coverage to be used for adjudication

verification
type: ObjectProperty
comment: Consent.verification: Whether a treatment instruction (e.g. artificial respiration: yes or no) was verified with the patient, his/her family or another authorized person.
modifierExtensionProperty: verification
title: Consent.verification: Consent Verified by patient or family

_availability
type: ObjectProperty
comment: (Modified) PractitionerRole.availability
comment: (Modified) HealthcareService.availability

resultingEffect
type: ObjectProperty
comment: AdverseEvent.resultingEffect: Information about the condition that occurred as a result of the adverse event, such as hives due to the exposure to a substance (for example, a drug or a chemical) or a broken leg as a result of the fall.
modifierExtensionProperty: resultingEffect
title: AdverseEvent.resultingEffect: Effect on the subject due to this event

timeout
type: ObjectProperty
comment: Subscription.timeout: If present, the maximum amount of time a server will allow before failing a notification attempt.
modifierExtensionProperty: timeout
title: Subscription.timeout: Timeout in seconds to attempt notification delivery

CapabilityStatementMessagingSupportedMessageComponent
type: Class
comment: CapabilityStatementMessagingComponent.CapabilityStatementMessagingSupportedMessageComponent: References to message definitions for messages this system can send or receive.
subclass of: BackboneElement
subclass of: Restriction
  cardinality: 1
  on property: definition
subclass of: Restriction
  all values from: canonical
  on property: definition
subclass of: Restriction
  cardinality: 1
  on property: mode
subclass of: Restriction
  all values from: code
  on property: mode

_revenue
type: ObjectProperty
comment: (Modified) ExplanationOfBenefit.item.detail.subDetail.revenue
comment: (Modified) ExplanationOfBenefit.item.detail.revenue
comment: (Modified) Claim.item.detail.subDetail.revenue
comment: (Modified) ClaimResponse.addItem.revenue
comment: (Modified) Claim.item.detail.revenue
comment: (Modified) ExplanationOfBenefit.addItem.detail.revenue
comment: (Modified) ClaimResponse.addItem.detail.revenue
comment: (Modified) Claim.item.revenue
comment: (Modified) ExplanationOfBenefit.addItem.detail.subDetail.revenue
comment: (Modified) ExplanationOfBenefit.addItem.revenue
comment: (Modified) ExplanationOfBenefit.item.revenue
comment: (Modified) ClaimResponse.addItem.detail.subDetail.revenue

_returnedAmount
type: ObjectProperty
comment: (Modified) PaymentReconciliation.returnedAmount

MedicationKnowledgeDefinitionalIngredientComponent
type: Class
comment: MedicationKnowledgeDefinitionalComponent.MedicationKnowledgeDefinitionalIngredientComponent: Identifies a particular constituent of interest in the product.
subclass of: BackboneElement
subclass of:
  union of: Restriction
    all values from: Ratio
    on property: strength
  union of: Restriction
    max cardinality: 1
    on property: strength
  union of: Restriction
    all values from: CodeableConcept
    on property: strength
  union of: Restriction
    max cardinality: 1
    on property: strength
  union of: Restriction
    all values from: Quantity
    on property: strength
  union of: Restriction
    max cardinality: 1
    on property: strength
subclass of: Restriction
  max cardinality: 1
  on property: type
subclass of: Restriction
  all values from: CodeableConcept
  on property: type
subclass of: Restriction
  cardinality: 1
  on property: item
subclass of: Restriction
  all values from: CodeableReference
  on property: item

candidate
type: ObjectProperty
comment: EnrollmentRequest.candidate: Patient Resource.
sub property of: who.actor
modifierExtensionProperty: _candidate
title: EnrollmentRequest.candidate: The subject to be enrolled

Subscription
type: Class
comment: The subscription resource describes a particular client's request to be notified about a SubscriptionTopic.
subclass of: infrastructure.exchange
subclass of: DomainResource
subclass of: Restriction
  max cardinality: 1
  on property: managingEntity
subclass of: Restriction
  all values from: code
  on property: contentType
subclass of: Restriction
  max cardinality: 1
  on property: content
subclass of: Restriction
  all values from: ContactPoint
  on property: contact
subclass of: Restriction
  max cardinality: 1
  on property: end
subclass of: Restriction
  cardinality: 1
  on property: channelType
subclass of: Restriction
  all values from: code
  on property: content
subclass of: Restriction
  all values from: Identifier
  on property: identifier
subclass of: Restriction
  all values from: string
  on property: name
subclass of: Restriction
  all values from: url
  on property: endpoint
subclass of: Restriction
  max cardinality: 1
  on property: heartbeatPeriod
subclass of: Restriction
  all values from: unsignedInt
  on property: timeout
subclass of: Restriction
  max cardinality: 1
  on property: contentType
subclass of: Restriction
  all values from: string
  on property: reason
subclass of: Restriction
  all values from: SubscriptionParameterComponent
  on property: parameter
subclass of: Restriction
  all values from: canonical
  on property: topic
subclass of: Restriction
  max cardinality: 1
  on property: reason
subclass of: Restriction
  all values from: SubscriptionFilterByComponent
  on property: filterBy
subclass of: Restriction
  cardinality: 1
  on property: topic
subclass of: Restriction
  max cardinality: 1
  on property: name
subclass of: Restriction
  max cardinality: 1
  on property: maxCount
subclass of: Restriction
  all values from: instant
  on property: end
subclass of: Restriction
  all values from: unsignedInt
  on property: heartbeatPeriod
subclass of: Restriction
  all values from: Reference
  on property: managingEntity
subclass of: Restriction
  max cardinality: 1
  on property: endpoint
subclass of: Restriction
  cardinality: 1
  on property: status
subclass of: Restriction
  all values from: Coding
  on property: channelType
subclass of: Restriction
  max cardinality: 1
  on property: timeout
subclass of: Restriction
  all values from: code
  on property: status
subclass of: Restriction
  all values from: positiveInt
  on property: maxCount
modifierExtensionClass: Subscription

relatedAction
type: ObjectProperty
comment: PlanDefinition.action.action.relatedAction: A relationship to another action such as "before" or "30-60 minutes after start of".
comment: RequestOrchestration.action.action.relatedAction: A relationship to another action such as "before" or "30-60 minutes after start of".
comment: RequestOrchestration.action.relatedAction: A relationship to another action such as "before" or "30-60 minutes after start of".
comment: PlanDefinition.action.relatedAction: A relationship to another action such as "before" or "30-60 minutes after start of".
modifierExtensionProperty: _relatedAction
title: RequestOrchestration.action.relatedAction: Relationship to another action
title: RequestOrchestration.action.action.relatedAction: Relationship to another action
title: PlanDefinition.action.relatedAction: Relationship to another action
title: PlanDefinition.action.action.relatedAction: Relationship to another action

textPresentation
type: ObjectProperty
comment: Ingredient.substance.strength.textPresentation: A textual represention of either the whole of the presentation strength or a part of it - with the rest being in Strength.presentation as a ratio.
modifierExtensionProperty: textPresentation
title: Ingredient.substance.strength.textPresentation: Text of either the whole presentation strength or a part of it (rest being in Strength.presentation as a ratio)

_supplements
type: ObjectProperty
comment: (Modified) CodeSystem.supplements

result
type: ObjectProperty
comment: DiagnosticReport.result: [Observations](observation.html) that are part of this diagnostic report.
comment: TestReport.test.action.operation.result: The result of this operation.
comment: TestReport.setup.action.assert.result: The result of this assertion.
comment: TestReport.result: The overall result from the execution of the TestScript.
comment: ResearchStudy.result: Link to one or more sets of results generated by the study. Could also link to a research registry holding the results such as ClinicalTrials.gov.
comment: TestReport.test.action.assert.result: The result of this assertion.
comment: TestReport.setup.action.operation.result: The result of this operation.
comment: GuidanceResponse.result: The actions, if any, produced by the evaluation of the artifact.
comment: TestPlan.testCase.assertion.result: The test assertion - the expected outcome from the test case execution.
comment: TestReport.teardown.action.operation.result: The result of this operation.
modifierExtensionProperty: result
title: TestPlan.testCase.assertion.result: The actual result assertion
title: TestReport.test.action.operation.result: pass | skip | fail | warning | error
title: TestReport.setup.action.assert.result: pass | skip | fail | warning | error
title: TestReport.result: pass | fail | pending
title: ResearchStudy.result: Link to results generated during the study
title: DiagnosticReport.result: Observations
title: GuidanceResponse.result: Proposed actions, if any
title: TestReport.setup.action.operation.result: pass | skip | fail | warning | error
title: TestReport.test.action.assert.result: pass | skip | fail | warning | error
title: TestReport.teardown.action.operation.result: pass | skip | fail | warning | error

policyText
type: ObjectProperty
comment: Consent.policyText: A Reference to the human readable policy explaining the basis for the Consent.
modifierExtensionProperty: _policyText
title: Consent.policyText: Human Readable Policy

_regionType
type: ObjectProperty
comment: (Modified) ImagingSelection.instance.imageRegion3D.regionType
comment: (Modified) ImagingSelection.instance.imageRegion2D.regionType

StratifierGroup
type: Class
comment: MeasureReportGroupComponent.MeasureReportGroupStratifierComponent.StratifierGroup: This element contains the results for a single stratum within the stratifier. For example, when stratifying on administrative gender, there will be four strata, one for each possible gender value.
subclass of: BackboneElement
subclass of:
  union of: Restriction
    all values from: Quantity
    on property: measureScore
  union of: Restriction
    max cardinality: 1
    on property: measureScore
  union of: Restriction
    all values from: dateTime
    on property: measureScore
  union of: Restriction
    max cardinality: 1
    on property: measureScore
  union of: Restriction
    all values from: CodeableConcept
    on property: measureScore
  union of: Restriction
    max cardinality: 1
    on property: measureScore
  union of: Restriction
    all values from: Period
    on property: measureScore
  union of: Restriction
    max cardinality: 1
    on property: measureScore
  union of: Restriction
    all values from: Range
    on property: measureScore
  union of: Restriction
    max cardinality: 1
    on property: measureScore
  union of: Restriction
    all values from: Duration
    on property: measureScore
  union of: Restriction
    max cardinality: 1
    on property: measureScore
subclass of: Restriction
  all values from: StratifierGroupPopulation
  on property: population
subclass of: Restriction
  all values from: MeasureReportGroupStratifierStratumComponentComponent
  on property: component
subclass of:
  union of: Restriction
    all values from: CodeableConcept
    on property: value
  union of: Restriction
    max cardinality: 1
    on property: value
  union of: Restriction
    all values from: boolean
    on property: value
  union of: Restriction
    max cardinality: 1
    on property: value
  union of: Restriction
    all values from: Quantity
    on property: value
  union of: Restriction
    max cardinality: 1
    on property: value
  union of: Restriction
    all values from: Range
    on property: value
  union of: Restriction
    max cardinality: 1
    on property: value
  union of: Restriction
    all values from: Reference
    on property: value
  union of: Restriction
    max cardinality: 1
    on property: value

_contract
type: ObjectProperty
comment: (Modified) Coverage.contract

_timeFromEvent
type: ObjectProperty
comment: (Modified) EvidenceVariable.characteristic.timeFromEvent
comment: (Modified) EvidenceVariable.characteristic.definitionByCombination.characteristic.timeFromEvent

notificationEvent
type: ObjectProperty
comment: SubscriptionStatus.notificationEvent: Detailed information about events relevant to this subscription notification.
modifierExtensionProperty: notificationEvent
title: SubscriptionStatus.notificationEvent: Detailed information about any events relevant to this notification

_inclusionCriteria
type: ObjectProperty
comment: (Modified) ValueSet.scope.inclusionCriteria

_orderMeaning
type: ObjectProperty
comment: (Modified) ElementDefinition.orderMeaning

autodelete
type: ObjectProperty
comment: TestScript.fixture.autodelete: Whether or not to implicitly delete the fixture during teardown. If true, the fixture is automatically deleted on each server being tested during teardown, therefore no delete operation is required for this fixture in the TestScript.teardown section.
modifierExtensionProperty: _autodelete
title: TestScript.fixture.autodelete: Whether or not to implicitly delete the fixture during teardown

qualifiers
type: ObjectProperty
comment: InsurancePlan.plan.specificCost.benefit.cost.qualifiers: Additional information about the cost, such as information about funding sources (e.g. HSA, HRA, FSA, RRA).
modifierExtensionProperty: _qualifiers
title: InsurancePlan.plan.specificCost.benefit.cost.qualifiers: Additional information about the cost

_regionsStudied
type: ObjectProperty
comment: (Modified) GenomicStudy.analysis.regionsStudied

_application
type: ObjectProperty
comment: (Modified) RegulatedAuthorization.case.application
comment: (Modified) RegulatedAuthorization.case.application.application

frequency
type: ObjectProperty
comment: VerificationResult.frequency: Frequency of revalidation.
comment: Timing.repeat.frequency: The number of times to repeat the action within the specified period. If frequencyMax is present, this element indicates the lower bound of the allowed range of the frequency.
modifierExtensionProperty: _frequency
title: VerificationResult.frequency: Frequency of revalidation
title: Timing.repeat.frequency: Indicates the number of repetitions that should occur within a period. I.e. Event occurs frequency times per period

_sourceMaterial
type: ObjectProperty
comment: (Modified) SubstanceDefinition.sourceMaterial

regulatoryBasis
type: ObjectProperty
comment: Consent.regulatoryBasis: A set of codes that indicate the regulatory basis (if any) that this consent supports.
modifierExtensionProperty: regulatoryBasis
title: Consent.regulatoryBasis: Regulations establishing base Consent

associationType
type: ObjectProperty
comment: InventoryItem.association.associationType: This attribute defined the type of association when establishing associations or relations between items, e.g. 'packaged within' or 'used with' or 'to be mixed with.
modifierExtensionProperty: associationType
title: InventoryItem.association.associationType: The type of association between the device and the other item

_software
type: ObjectProperty
comment: (Modified) TerminologyCapabilities.software
comment: (Modified) MessageHeader.source.software
comment: (Modified) CapabilityStatement.software

_copolymerConnectivity
type: ObjectProperty
comment: (Modified) SubstancePolymer.copolymerConnectivity

_approvalDate
type: ObjectProperty
comment: (Modified) NamingSystem.approvalDate
comment: (Modified) CodeSystem.approvalDate
comment: (Modified) Citation.approvalDate
comment: (Modified) ValueSet.approvalDate
comment: (Modified) EventDefinition.approvalDate
comment: (Modified) ArtifactAssessment.approvalDate
comment: (Modified) MetadataResource.approvalDate
comment: (Modified) PlanDefinition.approvalDate
comment: (Modified) SpecimenDefinition.approvalDate
comment: (Modified) ObservationDefinition.approvalDate
comment: (Modified) ChargeItemDefinition.approvalDate
comment: (Modified) ConceptMap.approvalDate
comment: (Modified) Questionnaire.approvalDate
comment: (Modified) Evidence.approvalDate
comment: (Modified) SubscriptionTopic.approvalDate
comment: (Modified) EvidenceVariable.approvalDate
comment: (Modified) ActivityDefinition.approvalDate
comment: (Modified) Library.approvalDate
comment: (Modified) Measure.approvalDate

totalVolume
type: ObjectProperty
comment: Medication.totalVolume: When the specified product code does not infer a package size, this is the specific amount of drug in the product. For example, when specifying a product that has the same strength (For example, Insulin glargine 100 unit per mL solution for injection), this attribute provides additional clarification of the package amount (For example, 3 mL, 10mL, etc.).
modifierExtensionProperty: totalVolume
title: Medication.totalVolume: When the specified product code does not infer a package size, this is the specific amount of drug in the product

AppointmentRecurrenceTemplateWeeklyTemplateComponent
type: Class
comment: AppointmentRecurrenceTemplateComponent.AppointmentRecurrenceTemplateWeeklyTemplateComponent: Information about weekly recurring appointments.
subclass of: BackboneElement
subclass of: Restriction
  all values from: boolean
  on property: sunday
subclass of: Restriction
  max cardinality: 1
  on property: wednesday
subclass of: Restriction
  max cardinality: 1
  on property: tuesday
subclass of: Restriction
  all values from: boolean
  on property: monday
subclass of: Restriction
  all values from: boolean
  on property: wednesday
subclass of: Restriction
  max cardinality: 1
  on property: monday
subclass of: Restriction
  all values from: positiveInt
  on property: weekInterval
subclass of: Restriction
  max cardinality: 1
  on property: sunday
subclass of: Restriction
  all values from: boolean
  on property: thursday
subclass of: Restriction
  all values from: boolean
  on property: tuesday
subclass of: Restriction
  all values from: boolean
  on property: friday
subclass of: Restriction
  all values from: boolean
  on property: saturday
subclass of: Restriction
  max cardinality: 1
  on property: weekInterval
subclass of: Restriction
  max cardinality: 1
  on property: thursday
subclass of: Restriction
  max cardinality: 1
  on property: friday
subclass of: Restriction
  max cardinality: 1
  on property: saturday

_requestedPerformer
type: ObjectProperty
comment: (Modified) Task.requestedPerformer

packagedProduct
type: ObjectProperty
comment: MedicationKnowledge.packaging.packagedProduct: A reference to a PackagedProductDefinition that provides the details of the product that is in the packaging and is being priced.
modifierExtensionProperty: packagedProduct
title: MedicationKnowledge.packaging.packagedProduct: The packaged medication that is being priced

tissue
type: ObjectProperty
comment: AdministrableProductDefinition.routeOfAdministration.targetSpecies.withdrawalPeriod.tissue: Coded expression for the type of tissue for which the withdrawal period applies, e.g. meat, milk.
modifierExtensionProperty: tissue
title: AdministrableProductDefinition.routeOfAdministration.targetSpecies.withdrawalPeriod.tissue: The type of tissue for which the withdrawal period applies, e.g. meat, milk

isSubpotent
type: ObjectProperty
comment: Immunization.isSubpotent: Indication if a dose is considered to be subpotent. By default, a dose should be considered to be potent.
modifierExtensionProperty: isSubpotent
title: Immunization.isSubpotent: Dose potency

_supportingInfoSequence
type: ObjectProperty
comment: (Modified) CoverageEligibilityRequest.item.supportingInfoSequence

_rating
type: ObjectProperty
comment: (Modified) Evidence.certainty.subcomponent.rating
comment: (Modified) Evidence.certainty.rating

maternalOrganismName
type: ObjectProperty
comment: SubstanceSourceMaterial.organism.hybrid.maternalOrganismName: The name of the maternal species constituting the hybrid organism shall be specified. For plants, the parents aren’t always known, and it is unlikely that it will be known which is maternal and which is paternal.
modifierExtensionProperty: maternalOrganismName
title: SubstanceSourceMaterial.organism.hybrid.maternalOrganismName: The name of the maternal species constituting the hybrid organism shall be specified. For plants, the parents aren’t always known, and it is unlikely that it will be known which is maternal and which is paternal

CommunicationRequest
type: Class
comment: A request to convey information; e.g. the CDS system proposes that an alert be sent to a responsible provider, the CDS system proposes that the public health agency be notified about a reportable condition.
subclass of: workflow.order
subclass of: DomainResource
subclass of: Restriction
  all values from: boolean
  on property: doNotPerform
subclass of: Restriction
  all values from: code
  on property: priority
subclass of: Restriction
  max cardinality: 1
  on property: requester
subclass of: Restriction
  all values from: CodeableReference
  on property: reason
subclass of: Restriction
  max cardinality: 1
  on property: encounter
subclass of: Restriction
  all values from: Reference
  on property: recipient
subclass of: Restriction
  all values from: code
  on property: status
subclass of: Restriction
  all values from: CodeableConcept
  on property: medium
subclass of: Restriction
  all values from: dateTime
  on property: authoredOn
subclass of: Restriction
  max cardinality: 1
  on property: priority
subclass of: Restriction
  cardinality: 1
  on property: intent
subclass of: Restriction
  all values from: Reference
  on property: replaces
subclass of: Restriction
  all values from: CodeableConcept
  on property: category
subclass of: Restriction
  all values from: Annotation
  on property: note
subclass of: Restriction
  all values from: CommunicationRequestPayloadComponent
  on property: payload
subclass of: Restriction
  all values from: Reference
  on property: about
subclass of: Restriction
  max cardinality: 1
  on property: statusReason
subclass of: Restriction
  cardinality: 1
  on property: status
subclass of: Restriction
  max cardinality: 1
  on property: groupIdentifier
subclass of: Restriction
  all values from: Reference
  on property: encounter
subclass of:
  union of: Restriction
    all values from: dateTime
    on property: occurrence
  union of: Restriction
    max cardinality: 1
    on property: occurrence
  union of: Restriction
    all values from: Period
    on property: occurrence
  union of: Restriction
    max cardinality: 1
    on property: occurrence
subclass of: Restriction
  all values from: Reference
  on property: informationProvider
subclass of: Restriction
  all values from: Identifier
  on property: identifier
subclass of: Restriction
  all values from: Identifier
  on property: groupIdentifier
subclass of: Restriction
  max cardinality: 1
  on property: doNotPerform
subclass of: Restriction
  all values from: code
  on property: intent
subclass of: Restriction
  all values from: Reference
  on property: requester
subclass of: Restriction
  max cardinality: 1
  on property: subject
subclass of: Restriction
  max cardinality: 1
  on property: authoredOn
subclass of: Restriction
  all values from: Reference
  on property: subject
subclass of: Restriction
  all values from: Reference
  on property: basedOn
subclass of: Restriction
  all values from: CodeableConcept
  on property: statusReason
modifierExtensionClass: CommunicationRequest

polymer
type: ObjectProperty
comment: SubstanceDefinition.polymer: Data items specific to polymers.
modifierExtensionProperty: polymer
title: SubstanceDefinition.polymer: Data items specific to polymers

initiatorActive
type: ObjectProperty
comment: ExampleScenario.process.step.process.step.alternative.step.operation.initiatorActive: If false, the initiator is deactivated right after the operation.
comment: ExampleScenario.process.step.operation.initiatorActive: If false, the initiator is deactivated right after the operation.
comment: ExampleScenario.process.step.alternative.step.operation.initiatorActive: If false, the initiator is deactivated right after the operation.
comment: ExampleScenario.process.step.alternative.step.process.step.operation.initiatorActive: If false, the initiator is deactivated right after the operation.
comment: ExampleScenario.process.step.process.step.operation.initiatorActive: If false, the initiator is deactivated right after the operation.
modifierExtensionProperty: initiatorActive
title: ExampleScenario.process.step.alternative.step.process.step.operation.initiatorActive: Initiator stays active?
title: ExampleScenario.process.step.process.step.operation.initiatorActive: Initiator stays active?
title: ExampleScenario.process.step.process.step.alternative.step.operation.initiatorActive: Initiator stays active?
title: ExampleScenario.process.step.operation.initiatorActive: Initiator stays active?
title: ExampleScenario.process.step.alternative.step.operation.initiatorActive: Initiator stays active?

_productStatus
type: ObjectProperty
comment: (Modified) BiologicallyDerivedProduct.productStatus

strand
type: ObjectProperty
comment: MolecularSequence.relative.startingSequence.strand: An absolute reference to a strand. The Watson strand is the strand whose 5'-end is on the short arm of the chromosome, and the Crick strand as the one whose 5'-end is on the long arm.
modifierExtensionProperty: strand
title: MolecularSequence.relative.startingSequence.strand: watson | crick

_outputParameters
type: ObjectProperty
comment: (Modified) GuidanceResponse.outputParameters

participantStatus
type: ObjectProperty
comment: AppointmentResponse.participantStatus: Participation status of the participant. When the status is declined or tentative if the start/end times are different to the appointment, then these times should be interpreted as a requested time change. When the status is accepted, the times can either be the time of the appointment (as a confirmation of the time) or can be empty.
modifierExtensionProperty: participantStatus
title: AppointmentResponse.participantStatus: accepted | declined | tentative | needs-action | entered-in-error

label
type: ObjectProperty
comment: RelatedArtifact.label: A short label that can be used to reference the citation from elsewhere in the containing artifact, such as a footnote index.
comment: TestScript.teardown.action.operation.label: The label would be used for tracking/logging purposes by test engines.
comment: TestScript.test.action.operation.label: The label would be used for tracking/logging purposes by test engines.
comment: Citation.citedArtifact.relatesTo.label: A short label that can be used to reference the related artifact from elsewhere in the containing artifact, such as a footnote index.
comment: ResearchStudy.label: Additional names for the study.
comment: TestScript.test.action.assert.label: The label would be used for tracking/logging purposes by test engines.
comment: ElementDefinition.example.label: Describes the purpose of this example among the set of examples.
comment: TestScript.setup.action.assert.label: The label would be used for tracking/logging purposes by test engines.
comment: ElementDefinition.label: A single preferred label which is the text to display beside the element indicating its meaning or to use to prompt for the element in a user display or form.
comment: TestScript.setup.action.operation.label: The label would be used for tracking/logging purposes by test engines.
comment: Requirements.statement.label: A short human usable label for this statement.
modifierExtensionProperty: label
title: Requirements.statement.label: Short Human label for this statement
title: TestScript.setup.action.assert.label: Tracking/logging assertion label
title: ElementDefinition.example.label: Describes the purpose of this example
title: TestScript.test.action.operation.label: Tracking/logging operation label
title: Citation.citedArtifact.relatesTo.label: Short label
title: RelatedArtifact.label: Short label
title: TestScript.test.action.assert.label: Tracking/logging assertion label
title: ResearchStudy.label: Additional names for the study
title: ElementDefinition.label: Name for element to display with or prompt for element
title: TestScript.teardown.action.operation.label: Tracking/logging operation label
title: TestScript.setup.action.operation.label: Tracking/logging operation label

manipulated
type: ObjectProperty
comment: Procedure.focalDevice.manipulated: The device that was manipulated (changed) during the procedure.
modifierExtensionProperty: manipulated
title: Procedure.focalDevice.manipulated: Device that was changed

_geometry
type: ObjectProperty
comment: (Modified) SubstancePolymer.geometry

Coding
type: Class
comment: A reference to a code defined by a terminology system.
subclass of: DataType
subclass of: Restriction
  all values from: string
  on property: version
subclass of: Restriction
  all values from: boolean
  on property: userSelected
subclass of: Restriction
  max cardinality: 1
  on property: display
subclass of: Restriction
  max cardinality: 1
  on property: system
subclass of: Restriction
  all values from: code
  on property: code
subclass of: Restriction
  max cardinality: 1
  on property: version
subclass of: Restriction
  max cardinality: 1
  on property: code
subclass of: Restriction
  all values from: string
  on property: display
subclass of: Restriction
  all values from: uri
  on property: system
subclass of: Restriction
  max cardinality: 1
  on property: userSelected
title: A reference to a code defined by a terminology system

requisition
type: ObjectProperty
comment: ServiceRequest.requisition: A shared identifier common to all service requests that were authorized more or less simultaneously by a single author, representing the composite or group identifier.
modifierExtensionProperty: requisition
title: ServiceRequest.requisition: Composite Request ID

InventoryReportInventoryListingComponent
type: Class
comment: InventoryReportInventoryListingComponent: An inventory listing section (grouped by any of the attributes).
subclass of: BackboneElement
subclass of: Restriction
  all values from: InventoryReportInventoryListingItemComponent
  on property: item
subclass of: Restriction
  max cardinality: 1
  on property: countingDateTime
subclass of: Restriction
  all values from: Reference
  on property: location
subclass of: Restriction
  max cardinality: 1
  on property: itemStatus
subclass of: Restriction
  max cardinality: 1
  on property: location
subclass of: Restriction
  all values from: dateTime
  on property: countingDateTime
subclass of: Restriction
  all values from: CodeableConcept
  on property: itemStatus

_parent
type: ObjectProperty
comment: (Modified) Specimen.parent
comment: (Modified) RiskAssessment.parent
comment: (Modified) Requirements.statement.parent
comment: (Modified) MessageDefinition.parent
comment: (Modified) Device.parent
comment: (Modified) BiologicallyDerivedProduct.parent

_net
type: ObjectProperty
comment: (Modified) Claim.item.net
comment: (Modified) Claim.item.detail.net
comment: (Modified) Contract.term.asset.valuedItem.net
comment: (Modified) Contract.term.group.asset.valuedItem.net
comment: (Modified) ClaimResponse.addItem.net
comment: (Modified) ExplanationOfBenefit.addItem.detail.net
comment: (Modified) ExplanationOfBenefit.item.detail.net
comment: (Modified) ClaimResponse.addItem.detail.subDetail.net
comment: (Modified) ExplanationOfBenefit.item.net
comment: (Modified) Claim.item.detail.subDetail.net
comment: (Modified) ClaimResponse.addItem.detail.net
comment: (Modified) ExplanationOfBenefit.item.detail.subDetail.net
comment: (Modified) ExplanationOfBenefit.addItem.detail.subDetail.net
comment: (Modified) ExplanationOfBenefit.addItem.net

presentation
type: ObjectProperty
comment: Ingredient.substance.strength.presentation
modifierExtensionProperty: presentation

flag
type: ObjectProperty
comment: List.entry.flag: The flag allows the system constructing the list to indicate the role and significance of the item in the list.
modifierExtensionProperty: flag
title: List.entry.flag: Status/Workflow information about this item

hoursOfOperation
type: ObjectProperty
comment: Location.hoursOfOperation: What days/times during a week is this location usually open, and any exceptions where the location is not available.
modifierExtensionProperty: hoursOfOperation
title: Location.hoursOfOperation: What days/times during a week is this location usually open (including exceptions)

encounter
type: ObjectProperty
comment: AdverseEvent.encounter: The Encounter associated with the start of the AdverseEvent.
comment: Immunization.encounter: The visit or admission or other contact between patient and health care provider the immunization was performed as part of.
comment: RiskAssessment.encounter: The encounter where the assessment was performed.
comment: NutritionIntake.encounter: The encounter that establishes the context for this NutritionIntake.
comment: MedicationAdministration.encounter: The visit, admission, or other contact between patient and health care provider during which the medication administration was performed.
comment: Condition.encounter: The Encounter during which this Condition was created or to which the creation of this record is tightly associated.
comment: DeviceDispense.encounter: The encounter that establishes the context for this event.
comment: CommunicationRequest.encounter: The Encounter during which this CommunicationRequest was created or to which the creation of this record is tightly associated.
comment: GuidanceResponse.encounter: The encounter during which this response was created or to which the creation of this record is tightly associated.
comment: RequestOrchestration.encounter: Describes the context of the request orchestration, if any.
comment: ServiceRequest.encounter: An encounter that provides additional information about the healthcare context in which this request is made.
comment: MedicationRequest.encounter: The Encounter during which this [x] was created or to which the creation of this record is tightly associated.
comment: ExplanationOfBenefit.encounter: Healthcare encounters related to this claim.
comment: Composition.encounter: Describes the clinical encounter or type of care this documentation is associated with.
comment: Claim.item.encounter: Healthcare encounters related to this claim.
comment: ChargeItem.encounter: This ChargeItem has the details of how the associated Encounter should be billed or otherwise be handled by finance systems.
comment: Claim.encounter: Healthcare encounters related to this claim.
comment: NutritionOrder.encounter: An encounter that provides additional information about the healthcare context in which this request is made.
comment: PaymentReconciliation.allocation.encounter: The Encounter to which this payment applies, may be completed by the receiver, used for search.
comment: DeviceRequest.encounter: An encounter that provides additional context in which this request is made.
comment: VisionPrescription.encounter: A reference to a resource that identifies the particular occurrence of contact between patient and health care provider during which the prescription was issued.
comment: EncounterHistory.encounter: The Encounter associated with this set of historic values.
comment: Flag.encounter: This alert is only relevant during the encounter.
comment: ImagingStudy.encounter: The healthcare event (e.g. a patient and healthcare provider interaction) during which this ImagingStudy is made.
comment: DiagnosticReport.encounter: The healthcare event (e.g. a patient and healthcare provider interaction) which this DiagnosticReport is about.
comment: Task.encounter: The healthcare event (e.g. a patient and healthcare provider interaction) during which this task was created.
comment: Procedure.encounter: The Encounter during which this Procedure was created or performed or to which the creation of this record is tightly associated.
comment: AuditEvent.encounter: This will typically be the encounter the event occurred, but some events may be initiated prior to or after the official completion of an encounter but still be tied to the context of the encounter (e.g. pre-admission lab tests).
comment: ExplanationOfBenefit.item.encounter: Healthcare encounters related to this claim.
comment: GenomicStudy.encounter: The healthcare event with which this genomics study is associated.
comment: MedicationDispense.encounter: The encounter that establishes the context for this event.
comment: Observation.encounter: The healthcare event (e.g. a patient and healthcare provider interaction) during which this observation is made.
comment: MedicationStatement.encounter: The encounter that establishes the context for this MedicationStatement.
comment: Communication.encounter: The Encounter during which this Communication was created or to which the creation of this record is tightly associated.
comment: CarePlan.encounter: The Encounter during which this CarePlan was created or to which the creation of this record is tightly associated.
comment: AllergyIntolerance.encounter: The encounter when the allergy or intolerance was asserted.
comment: List.encounter: The encounter that is the context in which this list was created.
comment: ClinicalImpression.encounter: The Encounter during which this ClinicalImpression was created or to which the creation of this record is tightly associated.
comment: QuestionnaireResponse.encounter: The Encounter during which this questionnaire response was created or to which the creation of this record is tightly associated.
comment: Transport.encounter: The healthcare event (e.g. a patient and healthcare provider interaction) during which this transport was created.
comment: DetectedIssue.encounter: The encounter during which this issue was detected.
comment: Provenance.encounter: This will typically be the encounter the event occurred, but some events may be initiated prior to or after the official completion of an encounter but still be tied to the context of the encounter (e.g. pre-admission lab tests).
comment: ClaimResponse.encounter: Healthcare encounters related to this claim.
sub property of: why
sub property of: context
modifierExtensionProperty: encounter
title: ClinicalImpression.encounter: The Encounter during which this ClinicalImpression was created
title: List.encounter: Context in which list created
title: Provenance.encounter: Encounter within which this event occurred or which the event is tightly associated
title: ExplanationOfBenefit.item.encounter: Encounters associated with the listed treatments
title: AdverseEvent.encounter: The Encounter associated with the start of the AdverseEvent
title: EncounterHistory.encounter: The Encounter associated with this set of historic values
title: Flag.encounter: Alert relevant during encounter
title: ExplanationOfBenefit.encounter: Encounters associated with the listed treatments
title: Immunization.encounter: Encounter immunization was part of
title: QuestionnaireResponse.encounter: Encounter the questionnaire response is part of
title: AuditEvent.encounter: Encounter within which this event occurred or which the event is tightly associated
title: MedicationAdministration.encounter: Encounter administered as part of
title: AllergyIntolerance.encounter: Encounter when the allergy or intolerance was asserted
title: DeviceRequest.encounter: Encounter motivating request
title: GuidanceResponse.encounter: Encounter during which the response was returned
title: MedicationRequest.encounter: Encounter created as part of encounter/admission/stay
title: ChargeItem.encounter: Encounter associated with this ChargeItem
title: PaymentReconciliation.allocation.encounter: Applied-to encounter
title: VisionPrescription.encounter: Created during encounter / admission / stay
title: Condition.encounter: The Encounter during which this Condition was created
title: ServiceRequest.encounter: Encounter in which the request was created
title: Communication.encounter: The Encounter during which this Communication was created
title: RiskAssessment.encounter: Where was assessment performed?
title: NutritionIntake.encounter: Encounter associated with NutritionIntake
title: CommunicationRequest.encounter: The Encounter during which this CommunicationRequest was created
title: Observation.encounter: Healthcare event during which this observation is made
title: Task.encounter: Healthcare event during which this task originated
title: DetectedIssue.encounter: Encounter detected issue is part of
title: ClaimResponse.encounter: Encounters associated with the listed treatments
title: RequestOrchestration.encounter: Created as part of
title: ImagingStudy.encounter: Encounter with which this imaging study is associated
title: Claim.item.encounter: Encounters associated with the listed treatments
title: CarePlan.encounter: The Encounter during which this CarePlan was created

applicability
type: ObjectProperty
comment: ChargeItemDefinition.propertyGroup.applicability: Expressions that describe applicability criteria for the priceComponent.
comment: ClinicalUseDefinition.contraindication.applicability: An expression that returns true or false, indicating whether the indication is applicable or not, after having applied its other elements.
comment: ChargeItemDefinition.applicability: Expressions that describe applicability criteria for the billing code.
comment: InsurancePlan.plan.specificCost.benefit.cost.applicability: Whether the cost applies to in-network or out-of-network providers (in-network; out-of-network; other).
comment: ClinicalUseDefinition.indication.applicability: An expression that returns true or false, indicating whether the indication is applicable or not, after having applied its other elements.
modifierExtensionProperty: _applicability
title: ClinicalUseDefinition.indication.applicability: An expression that returns true or false, indicating whether the indication is applicable or not, after having applied its other elements
title: InsurancePlan.plan.specificCost.benefit.cost.applicability: in-network | out-of-network | other
title: ClinicalUseDefinition.contraindication.applicability: An expression that returns true or false, indicating whether the indication is applicable or not, after having applied its other elements
title: ChargeItemDefinition.propertyGroup.applicability: Conditions under which the priceComponent is applicable
title: ChargeItemDefinition.applicability: Whether or not the billing code is applicable

releaseDate
type: ObjectProperty
comment: CapabilityStatement.software.releaseDate: Date this version of the software was released.
modifierExtensionProperty: releaseDate
title: CapabilityStatement.software.releaseDate: Date this version was released

_relationshipType
type: ObjectProperty
comment: (Modified) ClinicalUseDefinition.indication.otherTherapy.relationshipType
comment: (Modified) ClinicalUseDefinition.contraindication.otherTherapy.relationshipType

_managingOrganization
type: ObjectProperty
comment: (Modified) Person.managingOrganization
comment: (Modified) Patient.managingOrganization
comment: (Modified) Location.managingOrganization
comment: (Modified) EpisodeOfCare.managingOrganization
comment: (Modified) Endpoint.managingOrganization
comment: (Modified) CareTeam.managingOrganization

derivedFromCanonical
type: ObjectProperty
comment: SpecimenDefinition.derivedFromCanonical: The canonical URL pointing to another FHIR-defined SpecimenDefinition that is adhered to in whole or in part by this definition.
comment: ObservationDefinition.derivedFromCanonical: The canonical URL pointing to another FHIR-defined ObservationDefinition that is adhered to in whole or in part by this definition.
modifierExtensionProperty: derivedFromCanonical
title: SpecimenDefinition.derivedFromCanonical: Based on FHIR definition of another SpecimenDefinition
title: ObservationDefinition.derivedFromCanonical: Based on FHIR definition of another observation

_hasSeverity
type: ObjectProperty
comment: (Modified) ConditionDefinition.hasSeverity

cTerminalModification
type: ObjectProperty
comment: SubstanceProtein.subunit.cTerminalModification: The modification at the C-terminal shall be specified.
modifierExtensionProperty: _cTerminalModification
title: SubstanceProtein.subunit.cTerminalModification: The modification at the C-terminal shall be specified

ContentDefinition
type: Class
comment: Contract.ContentDefinition: Precusory content developed with a focus and intent of supporting the formation a Contract instance, which may be associated with and transformable into a Contract.
subclass of: BackboneElement
subclass of: Restriction
  all values from: CodeableConcept
  on property: subType
subclass of: Restriction
  cardinality: 1
  on property: publicationStatus
subclass of: Restriction
  all values from: CodeableConcept
  on property: type
subclass of: Restriction
  cardinality: 1
  on property: type
subclass of: Restriction
  max cardinality: 1
  on property: subType
subclass of: Restriction
  all values from: dateTime
  on property: publicationDate
subclass of: Restriction
  all values from: code
  on property: publicationStatus
subclass of: Restriction
  all values from: markdown
  on property: copyright
subclass of: Restriction
  all values from: Reference
  on property: publisher
subclass of: Restriction
  max cardinality: 1
  on property: copyright
subclass of: Restriction
  max cardinality: 1
  on property: publicationDate
subclass of: Restriction
  max cardinality: 1
  on property: publisher

_bodyLandmarkOrientation
type: ObjectProperty
comment: (Modified) BodyStructure.excludedStructure.bodyLandmarkOrientation
comment: (Modified) BodyStructure.includedStructure.bodyLandmarkOrientation

relationship
type: ObjectProperty
comment: PlanDefinition.action.action.relatedAction.relationship: The relationship of the start of this action to the related action.
comment: Contract.term.asset.relationship: Specifies the applicability of the term to an asset resource instance, and instances it refers to or instances that refer to it, and/or are owned by the offeree.
comment: PlanDefinition.action.relatedAction.relationship: The relationship of the start of this action to the related action.
comment: RequestOrchestration.action.relatedAction.relationship: The relationship of this action to the related action.
comment: Patient.contact.relationship: The nature of the relationship between the patient and the contact person.
comment: SubstanceDefinition.relationship: A link between this substance and another, with details of the relationship.
comment: Account.relatedAccount.relationship: Relationship of the associated Account.
comment: Contract.term.group.asset.relationship: Specifies the applicability of the term to an asset resource instance, and instances it refers to or instances that refer to it, and/or are owned by the offeree.
comment: RelatedPerson.relationship: The nature of the relationship between the related person and the patient.
comment: ConceptMap.group.unmapped.relationship: The default relationship value to apply between the source and target concepts when the source code is unmapped and the mode is 'fixed' or 'use-source-code'.
comment: ConceptMap.group.element.target.relationship: The relationship between the source and target concepts. The relationship is read from source to target (e.g. source-is-narrower-than-target).
comment: Coverage.relationship: The relationship of beneficiary (patient) to the subscriber.
comment: Claim.related.relationship: A code to convey how the claims are related.
comment: RequestOrchestration.action.action.relatedAction.relationship: The relationship of this action to the related action.
comment: FamilyMemberHistory.relationship: The type of relationship this person has to the patient (father, mother, brother etc.).
comment: ExplanationOfBenefit.related.relationship: A code to convey how the claims are related.
sub property of: class
modifierExtensionProperty: relationship
title: SubstanceDefinition.relationship: A link between this substance and another
title: Contract.term.asset.relationship: Kinship of the asset
title: FamilyMemberHistory.relationship: Relationship to the subject
title: RequestOrchestration.action.relatedAction.relationship: before | before-start | before-end | concurrent | concurrent-with-start | concurrent-with-end | after | after-start | after-end
title: Claim.related.relationship: How the reference claim is related
title: Contract.term.group.asset.relationship: Kinship of the asset
title: Coverage.relationship: Beneficiary relationship to the subscriber
title: ExplanationOfBenefit.related.relationship: How the reference claim is related
title: RequestOrchestration.action.action.relatedAction.relationship: before | before-start | before-end | concurrent | concurrent-with-start | concurrent-with-end | after | after-start | after-end
title: RelatedPerson.relationship: The relationship of the related person to the patient
title: Account.relatedAccount.relationship: Relationship of the associated Account
title: Patient.contact.relationship: The kind of relationship
title: ConceptMap.group.element.target.relationship: related-to | equivalent | source-is-narrower-than-target | source-is-broader-than-target | not-related-to
title: PlanDefinition.action.relatedAction.relationship: before | before-start | before-end | concurrent | concurrent-with-start | concurrent-with-end | after | after-start | after-end
title: PlanDefinition.action.action.relatedAction.relationship: before | before-start | before-end | concurrent | concurrent-with-start | concurrent-with-end | after | after-start | after-end
title: ConceptMap.group.unmapped.relationship: related-to | equivalent | source-is-narrower-than-target | source-is-broader-than-target | not-related-to

goal
type: ObjectProperty
comment: PlanDefinition.goal: A goal describes an expected outcome that activities within the plan are intended to achieve. For example, weight loss, restoring an activity of daily living, obtaining herd immunity via immunization, meeting a process improvement objective, meeting the acceptance criteria for a test as specified by a quality specification, etc.
comment: RequestOrchestration.action.action.goal: Goals that are intended to be achieved by following the requests in this action.
comment: RequestOrchestration.goal: Goals that are intended to be achieved by following the requests in this RequestOrchestration.
comment: CarePlan.goal: Describes the intended objective(s) of carrying out the care plan.
comment: RequestOrchestration.action.goal: Goals that are intended to be achieved by following the requests in this action.
sub property of: why
modifierExtensionProperty: goal
title: PlanDefinition.goal: What the plan is trying to accomplish
title: CarePlan.goal: Desired outcome of plan
title: RequestOrchestration.action.goal: What goals
title: RequestOrchestration.goal: What goals
title: RequestOrchestration.action.action.goal: What goals

_connectivity
type: ObjectProperty
comment: (Modified) SubstanceNucleicAcid.subunit.linkage.connectivity

_listMode
type: ObjectProperty
comment: (Modified) StructureMap.group.rule.rule.target.listMode
comment: (Modified) StructureMap.group.rule.rule.source.listMode
comment: (Modified) StructureMap.group.rule.target.listMode
comment: (Modified) StructureMap.group.rule.source.listMode

_availableTime
type: ObjectProperty
comment: (Modified) Availability.availableTime

property
type: ObjectProperty
comment: DeviceDefinition.property: Static or essentially fixed characteristics or features of this kind of device that are otherwise not captured in more specific attributes, e.g., time or timing attributes, resolution, accuracy, and physical attributes.
comment: CodeSystem.concept.property: A property value for this concept.
comment: ValueSet.compose.property: A property to return in the expansion, if the client doesn't ask for any particular properties. May be either a code from the code system definition (convenient) or a the formal URI that refers to the property. The special value '*' means all properties known to the server.
comment: ManufacturedItemDefinition.property: General characteristics of this item.
comment: CodeSystem.concept.concept.property: A property value for this concept.
comment: ValueSet.expansion.contains.property: A property value for this concept.
comment: ValueSet.expansion.property: A property defines an additional slot through which additional information can be provided about a concept.
comment: AdministrableProductDefinition.property: Characteristics e.g. a product's onset of action.
comment: BiologicallyDerivedProduct.property: A property that is specific to this BiologicallyDerviedProduct instance.
comment: Device.property: Static or essentially fixed characteristics or features of the device (e.g., time or timing attributes, resolution, accuracy, intended use or instructions for use, and physical attributes) that are not otherwise captured in more specific attributes.
comment: ConceptMap.property: A property defines a slot through which additional information can be provided about a map from source -> target.
comment: PackagedProductDefinition.packaging.packaging.property: General characteristics of this item.
comment: ManufacturedItemDefinition.component.property: General characteristics of this component.
comment: ValueSet.compose.include.filter.property: A code that identifies a property or a filter defined in the code system.
comment: ValueSet.expansion.contains.contains.property: A property value for this concept.
comment: CodeSystem.property: A property defines an additional slot through which additional information can be provided about a concept.
comment: TerminologyCapabilities.codeSystem.version.property: Properties supported for $lookup.
comment: ManufacturedItemDefinition.component.component.property: General characteristics of this component.
comment: ConceptMap.group.element.target.property: A property value for this source -> target mapping.
comment: SubstanceDefinition.property: General specifications for this substance.
comment: PackagedProductDefinition.packaging.property: General characteristics of this item.
comment: ValueSet.compose.exclude.filter.property: A code that identifies a property or a filter defined in the code system.
modifierExtensionProperty: property
title: CodeSystem.concept.property: Property value for the concept
title: ManufacturedItemDefinition.property: General characteristics of this item
title: AdministrableProductDefinition.property: Characteristics e.g. a product's onset of action
title: PackagedProductDefinition.packaging.packaging.property: General characteristics of this item
title: ManufacturedItemDefinition.component.component.property: General characteristics of this component
title: CodeSystem.concept.concept.property: Property value for the concept
title: PackagedProductDefinition.packaging.property: General characteristics of this item
title: ManufacturedItemDefinition.component.property: General characteristics of this component
title: SubstanceDefinition.property: General specifications for this substance
title: ValueSet.compose.exclude.filter.property: A property/filter defined by the code system
title: ValueSet.compose.property: Property to return if client doesn't override
title: CodeSystem.property: Additional information supplied about each concept
title: ConceptMap.property: Additional properties of the mapping
title: DeviceDefinition.property: Inherent, essentially fixed, characteristics of this kind of device, e.g., time properties, size, etc
title: ValueSet.compose.include.filter.property: A property/filter defined by the code system
title: BiologicallyDerivedProduct.property: A property that is specific to this BiologicallyDerviedProduct instance
title: ValueSet.expansion.contains.property: Property value for the concept
title: TerminologyCapabilities.codeSystem.version.property: Properties supported for $lookup
title: ConceptMap.group.element.target.property: Property value for the source -> target mapping
title: ValueSet.expansion.contains.contains.property: Property value for the concept
title: ValueSet.expansion.property: Additional information supplied about each concept
title: Device.property: Inherent, essentially fixed, characteristics of the device. e.g., time properties, size, material, etc.

_calibration
type: ObjectProperty
comment: (Modified) DeviceMetric.calibration

TerminologyCapabilitiesExpansionParameterComponent
type: Class
comment: TerminologyCapabilitiesExpansionComponent.TerminologyCapabilitiesExpansionParameterComponent: Supported expansion parameter.
subclass of: BackboneElement
subclass of: Restriction
  max cardinality: 1
  on property: documentation
subclass of: Restriction
  all values from: string
  on property: documentation
subclass of: Restriction
  cardinality: 1
  on property: name
subclass of: Restriction
  all values from: code
  on property: name

adjustmentReason
type: ObjectProperty
comment: ExplanationOfBenefit.payment.adjustmentReason: Reason for the payment adjustment.
comment: ClaimResponse.payment.adjustmentReason: Reason for the payment adjustment.
modifierExtensionProperty: adjustmentReason
title: ExplanationOfBenefit.payment.adjustmentReason: Explanation for the variance
title: ClaimResponse.payment.adjustmentReason: Explanation for the adjustment

AdministrableProductDefinitionRouteOfAdministrationTargetSpeciesComponent
type: Class
comment: AdministrableProductDefinitionRouteOfAdministrationComponent.AdministrableProductDefinitionRouteOfAdministrationTargetSpeciesComponent: A species for which this route applies.
subclass of: BackboneElement
subclass of: Restriction
  all values from: AdministrableProductDefinitionRouteOfAdministrationTargetSpeciesWithdrawalPeriodComponent
  on property: withdrawalPeriod
subclass of: Restriction
  cardinality: 1
  on property: code
subclass of: Restriction
  all values from: CodeableConcept
  on property: code

Basic
type: Class
comment: Basic is used for handling concepts not yet defined in FHIR, narrative-only resources that don't map to an existing resource, and custom resources not appropriate for inclusion in the FHIR specification.
subclass of: DomainResource
subclass of: infrastructure.structure
subclass of: Restriction
  cardinality: 1
  on property: code
subclass of: Restriction
  all values from: CodeableConcept
  on property: code
subclass of: Restriction
  max cardinality: 1
  on property: subject
subclass of: Restriction
  all values from: Identifier
  on property: identifier
subclass of: Restriction
  all values from: Reference
  on property: author
subclass of: Restriction
  all values from: Reference
  on property: subject
subclass of: Restriction
  max cardinality: 1
  on property: author
subclass of: Restriction
  max cardinality: 1
  on property: created
subclass of: Restriction
  all values from: dateTime
  on property: created
modifierExtensionClass: Basic

_isDerived
type: ObjectProperty
comment: (Modified) SpecimenDefinition.typeTested.isDerived

hierarchical
type: ObjectProperty
comment: TerminologyCapabilities.expansion.hierarchical: Whether the server can return nested value sets.
modifierExtensionProperty: hierarchical
title: TerminologyCapabilities.expansion.hierarchical: Whether the server can return nested value sets

_resultForCreate
type: ObjectProperty
comment: (Modified) SubscriptionTopic.resourceTrigger.queryCriteria.resultForCreate

_deviceName
type: ObjectProperty
comment: (Modified) DeviceDefinition.deviceName

_startDate
type: ObjectProperty
comment: (Modified) ResearchSubject.progress.startDate
comment: (Modified) GenomicStudy.startDate

Attachment
type: Class
comment: For referring to data content defined in other formats.
subclass of: DataType
subclass of: Restriction
  max cardinality: 1
  on property: pages
subclass of: Restriction
  all values from: base64Binary
  on property: hash
subclass of: Restriction
  max cardinality: 1
  on property: duration
subclass of: Restriction
  all values from: positiveInt
  on property: width
subclass of: Restriction
  max cardinality: 1
  on property: data
subclass of: Restriction
  max cardinality: 1
  on property: language
subclass of: Restriction
  max cardinality: 1
  on property: title
subclass of: Restriction
  max cardinality: 1
  on property: width
subclass of: Restriction
  all values from: positiveInt
  on property: height
subclass of: Restriction
  all values from: code
  on property: language
subclass of: Restriction
  all values from: base64Binary
  on property: data
subclass of: Restriction
  all values from: url
  on property: url
subclass of: Restriction
  max cardinality: 1
  on property: frames
subclass of: Restriction
  max cardinality: 1
  on property: url
subclass of: Restriction
  max cardinality: 1
  on property: hash
subclass of: Restriction
  max cardinality: 1
  on property: height
subclass of: Restriction
  all values from: positiveInt
  on property: frames
subclass of: Restriction
  all values from: positiveInt
  on property: pages
subclass of: Restriction
  all values from: string
  on property: title
subclass of: Restriction
  all values from: dateTime
  on property: creation
subclass of: Restriction
  all values from: integer64
  on property: size
subclass of: Restriction
  max cardinality: 1
  on property: size
subclass of: Restriction
  all values from: code
  on property: contentType
subclass of: Restriction
  all values from: decimal
  on property: duration
subclass of: Restriction
  max cardinality: 1
  on property: creation
subclass of: Restriction
  max cardinality: 1
  on property: contentType
title: Content in a format defined elsewhere

_patientPreparation
type: ObjectProperty
comment: (Modified) SpecimenDefinition.patientPreparation

CitationCitedArtifactPublicationFormComponent
type: Class
comment: CitationCitedArtifactComponent.CitationCitedArtifactPublicationFormComponent: If multiple, used to represent alternative forms of the article that are not separate citations.
subclass of: BackboneElement
subclass of: Restriction
  all values from: string
  on property: volume
subclass of: Restriction
  max cardinality: 1
  on property: volume
subclass of: Restriction
  all values from: markdown
  on property: copyright
subclass of: Restriction
  all values from: CodeableConcept
  on property: language
subclass of: Restriction
  all values from: string
  on property: publicationDateText
subclass of: Restriction
  max cardinality: 1
  on property: articleDate
subclass of: Restriction
  max cardinality: 1
  on property: publicationDateSeason
subclass of: Restriction
  all values from: CodeableConcept
  on property: citedMedium
subclass of: Restriction
  all values from: dateTime
  on property: lastRevisionDate
subclass of: Restriction
  max cardinality: 1
  on property: publishedIn
subclass of: Restriction
  max cardinality: 1
  on property: citedMedium
subclass of: Restriction
  max cardinality: 1
  on property: issue
subclass of: Restriction
  max cardinality: 1
  on property: lastRevisionDate
subclass of: Restriction
  max cardinality: 1
  on property: accessionNumber
subclass of: Restriction
  all values from: string
  on property: pageCount
subclass of: Restriction
  all values from: string
  on property: accessionNumber
subclass of: Restriction
  max cardinality: 1
  on property: copyright
subclass of: Restriction
  all values from: string
  on property: pageString
subclass of: Restriction
  max cardinality: 1
  on property: firstPage
subclass of: Restriction
  max cardinality: 1
  on property: lastPage
subclass of: Restriction
  max cardinality: 1
  on property: publicationDateText
subclass of: Restriction
  all values from: string
  on property: firstPage
subclass of: Restriction
  all values from: string
  on property: publicationDateSeason
subclass of: Restriction
  max cardinality: 1
  on property: pageCount
subclass of: Restriction
  all values from: dateTime
  on property: articleDate
subclass of: Restriction
  all values from: string
  on property: issue
subclass of: Restriction
  all values from: CitationCitedArtifactPublicationFormPublishedInComponent
  on property: publishedIn
subclass of: Restriction
  max cardinality: 1
  on property: pageString
subclass of: Restriction
  all values from: string
  on property: lastPage

windowStart
type: ObjectProperty
comment: MolecularSequence.relative.startingSequence.windowStart: Start position of the window on the starting sequence. This value should honor the rules of the coordinateSystem.
modifierExtensionProperty: windowStart
title: MolecularSequence.relative.startingSequence.windowStart: Start position of the window on the starting sequence

_propertyGroup
type: ObjectProperty
comment: (Modified) ChargeItemDefinition.propertyGroup

languageCode
type: ObjectProperty
comment: DeviceDefinition.languageCode: Language code for the human-readable text strings produced by the device (all supported).
modifierExtensionProperty: languageCode
title: DeviceDefinition.languageCode: Language code for the human-readable text strings produced by the device (all supported)

_canPushUpdates
type: ObjectProperty
comment: (Modified) VerificationResult.primarySource.canPushUpdates

groupingBehavior
type: ObjectProperty
comment: PlanDefinition.action.action.groupingBehavior: Defines the grouping behavior for the action and its children.
comment: PlanDefinition.action.groupingBehavior: Defines the grouping behavior for the action and its children.
comment: RequestOrchestration.action.action.groupingBehavior: Defines the grouping behavior for the action and its children.
comment: RequestOrchestration.action.groupingBehavior: Defines the grouping behavior for the action and its children.
modifierExtensionProperty: groupingBehavior
title: PlanDefinition.action.groupingBehavior: visual-group | logical-group | sentence-group
title: PlanDefinition.action.action.groupingBehavior: visual-group | logical-group | sentence-group
title: RequestOrchestration.action.action.groupingBehavior: visual-group | logical-group | sentence-group
title: RequestOrchestration.action.groupingBehavior: visual-group | logical-group | sentence-group

for
type: ObjectProperty
comment: Ingredient.for: The product which this ingredient is a constituent part of.
comment: Task.for: The entity who benefits from the performance of the service specified in the task (e.g., the patient).
comment: Transport.for: The entity who benefits from the performance of the service specified in the transport (e.g., the patient).
sub property of: who.focus
modifierExtensionProperty: for
title: Ingredient.for: The product which this ingredient is a constituent part of
title: Transport.for: Beneficiary of the Transport
title: Task.for: Beneficiary of the Task

_studyUid
type: ObjectProperty
comment: (Modified) ImagingSelection.studyUid

_event
type: ObjectProperty
comment: (Modified) MessageHeader.event
comment: (Modified) ClaimResponse.event
comment: (Modified) MessageDefinition.event
comment: (Modified) ExplanationOfBenefit.event
comment: (Modified) EvidenceVariable.characteristic.definitionByCombination.characteristic.timeFromEvent.event
comment: (Modified) Claim.event
comment: (Modified) Composition.event
comment: (Modified) CoverageEligibilityRequest.event
comment: (Modified) Timing.event
comment: (Modified) DocumentReference.event
comment: (Modified) SubscriptionTopic.eventTrigger.event
comment: (Modified) EvidenceVariable.characteristic.timeFromEvent.event
comment: (Modified) CoverageEligibilityResponse.event

informationProvider
type: ObjectProperty
comment: CommunicationRequest.informationProvider: The entity (e.g. person, organization, clinical information system, or device) which is to be the source of the communication.
sub property of: who.actor
modifierExtensionProperty: _informationProvider
title: CommunicationRequest.informationProvider: Who should share the information

network
type: ObjectProperty
comment: InsurancePlan.coverage.network: Reference to the network that providing the type of coverage.
comment: ExplanationOfBenefit.benefitBalance.network: Is a flag to indicate whether the benefits refer to in-network providers or out-of-network providers.
comment: AuditEvent.entity.agent.network
comment: Coverage.network: The insurer-specific identifier for the insurer-defined network of providers to which the beneficiary may seek treatment which will be covered at the 'in-network' rate, otherwise 'out of network' terms and conditions apply.
comment: AuditEvent.agent.network
comment: Coverage.costToBeneficiary.network: Is a flag to indicate whether the benefits refer to in-network providers or out-of-network providers.
comment: InsurancePlan.network: Reference to the network included in the health insurance product.
comment: CoverageEligibilityResponse.insurance.item.network: Is a flag to indicate whether the benefits refer to in-network providers or out-of-network providers.
comment: OrganizationAffiliation.network: The network in which the participatingOrganization provides the role's services (if defined) at the indicated locations (if defined).
comment: InsurancePlan.plan.network: Reference to the network that providing the type of coverage.
modifierExtensionProperty: _network
title: CoverageEligibilityResponse.insurance.item.network: In or out of network
title: ExplanationOfBenefit.benefitBalance.network: In or out of network
title: OrganizationAffiliation.network: The network in which the participatingOrganization provides the role's services (if defined) at the indicated locations (if defined)
title: Coverage.costToBeneficiary.network: In or out of network
title: InsurancePlan.plan.network: What networks provide coverage
title: InsurancePlan.coverage.network: What networks provide coverage
title: Coverage.network: Insurer network
title: InsurancePlan.network: What networks are Included

_manufacturedDoseForm
type: ObjectProperty
comment: (Modified) ManufacturedItemDefinition.manufacturedDoseForm

assert
type: ObjectProperty
comment: TestScript.setup.action.assert: Evaluates the results of previous operations to determine if the server under test behaves appropriately.
comment: TestReport.setup.action.assert: The results of the assertion performed on the previous operations.
comment: TestReport.test.action.assert: The results of the assertion performed on the previous operations.
comment: TestScript.test.action.assert: Evaluates the results of previous operations to determine if the server under test behaves appropriately.
modifierExtensionProperty: _assert
title: TestReport.setup.action.assert: The assertion to perform
title: TestScript.setup.action.assert: The assertion to perform
title: TestScript.test.action.assert: The setup assertion to perform
title: TestReport.test.action.assert: The assertion performed

_warningOnly
type: ObjectProperty
comment: (Modified) TestScript.test.action.assert.warningOnly
comment: (Modified) TestScript.setup.action.assert.warningOnly

isSummary
type: ObjectProperty
comment: ElementDefinition.isSummary: Whether the element should be included if a client requests a search with the parameter _summary=true.
modifierExtensionProperty: _isSummary
title: ElementDefinition.isSummary: Include when _summary = true?

attachedDocument
type: ObjectProperty
comment: RegulatedAuthorization.attachedDocument: Additional information or supporting documentation about the authorization.
comment: PackagedProductDefinition.attachedDocument: Additional information or supporting documentation about the packaged product.
comment: MedicinalProductDefinition.attachedDocument: Additional information or supporting documentation about the medicinal product.
modifierExtensionProperty: attachedDocument
title: RegulatedAuthorization.attachedDocument: Additional information or supporting documentation about the authorization
title: PackagedProductDefinition.attachedDocument: Additional information or supporting documentation about the packaged product
title: MedicinalProductDefinition.attachedDocument: Additional documentation about the medicinal product

_unit
type: ObjectProperty
comment: (Modified) SubstancePolymer.repeat.repeatUnit.unit
comment: (Modified) ExplanationOfBenefit.benefitBalance.unit
comment: (Modified) DeviceMetric.unit
comment: (Modified) CoverageEligibilityResponse.insurance.item.unit
comment: (Modified) Coverage.costToBeneficiary.unit
comment: (Modified) Quantity.unit

_endDate
type: ObjectProperty
comment: (Modified) ResearchSubject.progress.endDate

authoredOn
type: ObjectProperty
comment: RequestOrchestration.authoredOn: Indicates when the request orchestration was created.
comment: MedicationRequest.authoredOn: The date (and perhaps time) when the prescription was initially written or authored on.
comment: Task.authoredOn: The date and time this task was created.
comment: Transport.authoredOn: The date and time this transport was created.
comment: ServiceRequest.authoredOn: When the request transitioned to being actionable.
comment: DeviceRequest.authoredOn: When the request transitioned to being actionable.
comment: SupplyRequest.authoredOn: When the request was made.
comment: CommunicationRequest.authoredOn: For draft requests, indicates the date of initial creation. For requests with other statuses, indicates the date of activation.
sub property of: when.recorded
modifierExtensionProperty: _authoredOn
title: Task.authoredOn: Task Creation Date
title: ServiceRequest.authoredOn: Date request signed
title: DeviceRequest.authoredOn: When recorded
title: RequestOrchestration.authoredOn: When the request orchestration was authored
title: Transport.authoredOn: Transport Creation Date
title: SupplyRequest.authoredOn: When the request was made
title: CommunicationRequest.authoredOn: When request transitioned to being actionable
title: MedicationRequest.authoredOn: When request was initially authored

_geographicalLocation
type: ObjectProperty
comment: (Modified) SubstanceSourceMaterial.geographicalLocation

CitationCitedArtifactClassificationComponent
type: Class
comment: CitationCitedArtifactComponent.CitationCitedArtifactClassificationComponent: The assignment to an organizing scheme.
subclass of: BackboneElement
subclass of: Restriction
  all values from: Reference
  on property: artifactAssessment
subclass of: Restriction
  all values from: CodeableConcept
  on property: classifier
subclass of: Restriction
  max cardinality: 1
  on property: type
subclass of: Restriction
  all values from: CodeableConcept
  on property: type

userSelected
type: ObjectProperty
comment: Coding.userSelected: Indicates that this coding was chosen by a user directly - e.g. off a pick list of available items (codes or displays).
modifierExtensionProperty: userSelected
title: Coding.userSelected: If this coding was chosen directly by the user

_prognosisCodeableConcept
type: ObjectProperty
comment: (Modified) ClinicalImpression.prognosisCodeableConcept

dateCriterion
type: ObjectProperty
comment: ImmunizationRecommendation.recommendation.dateCriterion: Vaccine date recommendations. For example, earliest date to administer, latest date to administer, etc.
modifierExtensionProperty: _dateCriterion
title: ImmunizationRecommendation.recommendation.dateCriterion: Dates governing proposed immunization

additionalInstruction
type: ObjectProperty
comment: Dosage.additionalInstruction: Supplemental instructions to the patient on how to take the medication (e.g. "with meals" or"take half to one hour before food") or warnings for the patient about the medication (e.g. "may cause drowsiness" or "avoid exposure of skin to direct sunlight or sunlamps").
modifierExtensionProperty: _additionalInstruction
title: Dosage.additionalInstruction: Supplemental instruction or warnings to the patient - e.g. "with meals", "may cause drowsiness"

specialPrecautionsForStorage
type: ObjectProperty
comment: ProductShelfLife.specialPrecautionsForStorage: Special precautions for storage, if any, can be specified using an appropriate controlled vocabulary The controlled term and the controlled term identifier shall be specified.
modifierExtensionProperty: specialPrecautionsForStorage
title: ProductShelfLife.specialPrecautionsForStorage: Special precautions for storage, if any, can be specified using an appropriate controlled vocabulary The controlled term and the controlled term identifier shall be specified

population
type: ObjectProperty
comment: ClinicalUseDefinition.population: The population group to which this applies.
comment: MeasureReport.group.population: The populations that make up the population group, one for each type of population appropriate for the measure.
comment: Measure.group.population: A population criteria for the measure.
comment: MeasureReport.group.stratifier.stratum.population: The populations that make up the stratum, one for each type of population appropriate to the measure.
modifierExtensionProperty: _population
title: MeasureReport.group.population: The populations in the group
title: ClinicalUseDefinition.population: The population group to which this applies
title: MeasureReport.group.stratifier.stratum.population: Population results in this stratum
title: Measure.group.population: Population criteria

_member
type: ObjectProperty
comment: (Modified) Group.member
comment: (Modified) CareTeam.participant.member

securityLabel
type: ObjectProperty
comment: AuditEvent.entity.securityLabel: Security labels for the identified entity.
comment: DocumentReference.securityLabel: A set of Security-Tag codes specifying the level of privacy/security of the Document found at DocumentReference.content.attachment.url. Note that DocumentReference.meta.security contains the security labels of the data elements in DocumentReference, while DocumentReference.securityLabel contains the security labels for the document the reference refers to. The distinction recognizes that the document may contain sensitive information, while the DocumentReference is metadata about the document and thus might not be as sensitive as the document. For example: a psychotherapy episode may contain highly sensitive information, while the metadata may simply indicate that some episode happened.
comment: Contract.term.securityLabel: Security labels that protect the handling of information about the term and its elements, which may be specifically identified.
comment: Contract.term.group.securityLabel: Security labels that protect the handling of information about the term and its elements, which may be specifically identified.
comment: Consent.provision.securityLabel: A security label, comprised of 0..* security label fields (Privacy tags), which define which resources are controlled by this exception.
comment: Consent.provision.provision.securityLabel: A security label, comprised of 0..* security label fields (Privacy tags), which define which resources are controlled by this exception.
sub property of: context
modifierExtensionProperty: _securityLabel
title: Consent.provision.securityLabel: Security Labels that define affected resources
title: Contract.term.securityLabel: Protection for the Term
title: AuditEvent.entity.securityLabel: Security labels on the entity
title: Consent.provision.provision.securityLabel: Security Labels that define affected resources
title: DocumentReference.securityLabel: Document security-tags
title: Contract.term.group.securityLabel: Protection for the Term

_renderedDosageInstruction
type: ObjectProperty
comment: (Modified) MedicationStatement.renderedDosageInstruction
comment: (Modified) MedicationRequest.renderedDosageInstruction
comment: (Modified) MedicationDispense.renderedDosageInstruction

Notes
type: Class
comment: PaymentReconciliation.Notes: A note that describes or explains the processing in a human readable form.
subclass of: BackboneElement
subclass of: Restriction
  max cardinality: 1
  on property: text
subclass of: Restriction
  all values from: string
  on property: text
subclass of: Restriction
  max cardinality: 1
  on property: type
subclass of: Restriction
  all values from: code
  on property: type

_dynamicValue
type: ObjectProperty
comment: (Modified) RequestOrchestration.action.action.dynamicValue
comment: (Modified) RequestOrchestration.action.dynamicValue
comment: (Modified) PlanDefinition.action.action.dynamicValue
comment: (Modified) PlanDefinition.action.dynamicValue
comment: (Modified) ActivityDefinition.dynamicValue

_confidentialityIndicator
type: ObjectProperty
comment: (Modified) MedicinalProductDefinition.operation.confidentialityIndicator

_intendedUse
type: ObjectProperty
comment: (Modified) RegulatedAuthorization.intendedUse
comment: (Modified) DeviceDefinition.guideline.intendedUse

lastUpdated
type: ObjectProperty
comment: Meta.lastUpdated: When the resource last changed - e.g. when the version changed.
modifierExtensionProperty: lastUpdated
title: Meta.lastUpdated: When the resource version last changed

deceased
type: ObjectProperty
comment: Practitioner.deceased
comment: Person.deceased
comment: Patient.deceased
comment: FamilyMemberHistory.deceased
modifierExtensionProperty: deceased

NutritionOrderEnteralFormulaAdditiveComponent
type: Class
comment: NutritionOrderEnteralFormulaComponent.NutritionOrderEnteralFormulaAdditiveComponent: Indicates modular components to be provided in addition or mixed with the base formula.
subclass of: BackboneElement
subclass of: Restriction
  max cardinality: 1
  on property: quantity
subclass of: Restriction
  all values from: string
  on property: productName
subclass of: Restriction
  max cardinality: 1
  on property: type
subclass of: Restriction
  all values from: SimpleQuantity
  on property: quantity
subclass of: Restriction
  max cardinality: 1
  on property: productName
subclass of: Restriction
  all values from: CodeableReference
  on property: type

designation
type: ObjectProperty
comment: ValueSet.expansion.contains.designation: Additional representations for this item - other languages, aliases, specialized purposes, used for particular purposes, etc. These are relevant when the conditions of the expansion do not fix to a single correct representation.
comment: CodeSystem.concept.concept.designation: Additional representations for the concept - other languages, aliases, specialized purposes, used for particular purposes, etc.
comment: CodeSystem.concept.designation: Additional representations for the concept - other languages, aliases, specialized purposes, used for particular purposes, etc.
comment: ValueSet.compose.include.concept.designation: Additional representations for this concept when used in this value set - other languages, aliases, specialized purposes, used for particular purposes, etc.
comment: ValueSet.compose.exclude.concept.designation: Additional representations for this concept when used in this value set - other languages, aliases, specialized purposes, used for particular purposes, etc.
comment: ValueSet.expansion.contains.contains.designation: Additional representations for this item - other languages, aliases, specialized purposes, used for particular purposes, etc. These are relevant when the conditions of the expansion do not fix to a single correct representation.
modifierExtensionProperty: designation
title: ValueSet.compose.exclude.concept.designation: Additional representations for this concept
title: ValueSet.compose.include.concept.designation: Additional representations for this concept
title: CodeSystem.concept.designation: Additional representations for the concept
title: ValueSet.expansion.contains.contains.designation: Additional representations for this item
title: ValueSet.expansion.contains.designation: Additional representations for this item
title: CodeSystem.concept.concept.designation: Additional representations for the concept

reportedDateTime
type: ObjectProperty
comment: InventoryReport.reportedDateTime: When the report has been submitted.
modifierExtensionProperty: reportedDateTime
title: InventoryReport.reportedDateTime: When the report has been submitted

productOrServiceEnd
type: ObjectProperty
comment: ExplanationOfBenefit.addItem.productOrServiceEnd: This contains the end of a range of product, service, drug or other billing codes for the item. This element is not used when the .productOrService is a group code. This value may only be present when a .productOfService code has been provided to convey the start of the range. Typically this value may be used only with preauthorizations and not with claims.
comment: ExplanationOfBenefit.addItem.detail.subDetail.productOrServiceEnd: This contains the end of a range of product, service, drug or other billing codes for the item. This element is not used when the .productOrService is a group code. This value may only be present when a .productOfService code has been provided to convey the start of the range. Typically this value may be used only with preauthorizations and not with claims.
comment: ClaimResponse.addItem.detail.subDetail.productOrServiceEnd: This contains the end of a range of product, service, drug or other billing codes for the item. This element is not used when the .productOrService is a group code. This value may only be present when a .productOfService code has been provided to convey the start of the range. Typically this value may be used only with preauthorizations and not with claims.
comment: ClaimResponse.addItem.productOrServiceEnd: This contains the end of a range of product, service, drug or other billing codes for the item. This element is not used when the .productOrService is a group code. This value may only be present when a .productOfService code has been provided to convey the start of the range. Typically this value may be used only with preauthorizations and not with claims.
comment: ExplanationOfBenefit.item.detail.subDetail.productOrServiceEnd: This contains the end of a range of product, service, drug or other billing codes for the item. This element is not used when the .productOrService is a group code. This value may only be present when a .productOfService code has been provided to convey the start of the range. Typically this value may be used only with preauthorizations and not with claims.
comment: ExplanationOfBenefit.item.detail.productOrServiceEnd: This contains the end of a range of product, service, drug or other billing codes for the item. This element is not used when the .productOrService is a group code. This value may only be present when a .productOfService code has been provided to convey the start of the range. Typically this value may be used only with preauthorizations and not with claims.
comment: ExplanationOfBenefit.addItem.detail.productOrServiceEnd: This contains the end of a range of product, service, drug or other billing codes for the item. This element is not used when the .productOrService is a group code. This value may only be present when a .productOfService code has been provided to convey the start of the range. Typically this value may be used only with preauthorizations and not with claims.
comment: Claim.item.productOrServiceEnd: This contains the end of a range of product, service, drug or other billing codes for the item. This element is not used when the .productOrService is a group code. This value may only be present when a .productOfService code has been provided to convey the start of the range. Typically this value may be used only with preauthorizations and not with claims.
comment: Claim.item.detail.productOrServiceEnd: This contains the end of a range of product, service, drug or other billing codes for the item. This element is not used when the .productOrService is a group code. This value may only be present when a .productOfService code has been provided to convey the start of the range. Typically this value may be used only with preauthorizations and not with claims.
comment: ExplanationOfBenefit.item.productOrServiceEnd: This contains the end of a range of product, service, drug or other billing codes for the item. This element is not used when the .productOrService is a group code. This value may only be present when a .productOfService code has been provided to convey the start of the range. Typically this value may be used only with preauthorizations and not with claims.
comment: ClaimResponse.addItem.detail.productOrServiceEnd: This contains the end of a range of product, service, drug or other billing codes for the item. This element is not used when the .productOrService is a group code. This value may only be present when a .productOfService code has been provided to convey the start of the range. Typically this value may be used only with preauthorizations and not with claims.
comment: Claim.item.detail.subDetail.productOrServiceEnd: This contains the end of a range of product, service, drug or other billing codes for the item. This element is not used when the .productOrService is a group code. This value may only be present when a .productOfService code has been provided to convey the start of the range. Typically this value may be used only with preauthorizations and not with claims.
modifierExtensionProperty: productOrServiceEnd
title: ClaimResponse.addItem.detail.subDetail.productOrServiceEnd: End of a range of codes
title: Claim.item.productOrServiceEnd: End of a range of codes
title: ClaimResponse.addItem.detail.productOrServiceEnd: End of a range of codes
title: ExplanationOfBenefit.addItem.productOrServiceEnd: End of a range of codes
title: ExplanationOfBenefit.addItem.detail.productOrServiceEnd: End of a range of codes
title: ExplanationOfBenefit.item.detail.productOrServiceEnd: End of a range of codes
title: ClaimResponse.addItem.productOrServiceEnd: End of a range of codes
title: ExplanationOfBenefit.addItem.detail.subDetail.productOrServiceEnd: End of a range of codes
title: Claim.item.detail.subDetail.productOrServiceEnd: End of a range of codes
title: ExplanationOfBenefit.item.productOrServiceEnd: End of a range of codes
title: ExplanationOfBenefit.item.detail.subDetail.productOrServiceEnd: End of a range of codes
title: Claim.item.detail.productOrServiceEnd: End of a range of codes

teardown
type: ObjectProperty
comment: TestScript.teardown: A series of operations required to clean up after all the tests are executed (successfully or otherwise).
comment: TestReport.teardown: The results of the series of operations required to clean up after all the tests were executed (successfully or otherwise).
modifierExtensionProperty: teardown
title: TestScript.teardown: A series of required clean up steps
title: TestReport.teardown: The results of running the series of required clean up steps

securityLabelNumber
type: ObjectProperty
comment: Contract.term.action.securityLabelNumber: Security labels that protects the action.
comment: Contract.term.group.asset.securityLabelNumber: Security labels that protects the asset.
comment: Contract.term.group.offer.securityLabelNumber: Security labels that protects the offer.
comment: Contract.term.group.action.securityLabelNumber: Security labels that protects the action.
comment: Contract.term.group.asset.valuedItem.securityLabelNumber: A set of security labels that define which terms are controlled by this condition.
comment: Contract.term.asset.securityLabelNumber: Security labels that protects the asset.
comment: Contract.term.asset.valuedItem.securityLabelNumber: A set of security labels that define which terms are controlled by this condition.
comment: Contract.term.offer.securityLabelNumber: Security labels that protects the offer.
modifierExtensionProperty: _securityLabelNumber
title: Contract.term.asset.securityLabelNumber: Asset restriction numbers
title: Contract.term.asset.valuedItem.securityLabelNumber: Security Labels that define affected terms
title: Contract.term.action.securityLabelNumber: Action restriction numbers
title: Contract.term.group.offer.securityLabelNumber: Offer restriction numbers
title: Contract.term.group.asset.valuedItem.securityLabelNumber: Security Labels that define affected terms
title: Contract.term.offer.securityLabelNumber: Offer restriction numbers
title: Contract.term.group.action.securityLabelNumber: Action restriction numbers
title: Contract.term.group.asset.securityLabelNumber: Asset restriction numbers

_manufactureDate
type: ObjectProperty
comment: (Modified) Device.manufactureDate

_textFilter
type: ObjectProperty
comment: (Modified) TerminologyCapabilities.expansion.textFilter

_route
type: ObjectProperty
comment: (Modified) MedicinalProductDefinition.route
comment: (Modified) MedicationAdministration.dosage.route
comment: (Modified) Immunization.route
comment: (Modified) Dosage.route

parentSubstanceName
type: ObjectProperty
comment: SubstanceSourceMaterial.parentSubstanceName: The parent substance of the Herbal Drug, or Herbal preparation.
modifierExtensionProperty: parentSubstanceName
title: SubstanceSourceMaterial.parentSubstanceName: The parent substance of the Herbal Drug, or Herbal preparation

_docStatus
type: ObjectProperty
comment: (Modified) DocumentReference.docStatus

ArtifactAssessmentContentComponentContentContent
type: Class
comment: If the informationType is container, the components of the content.
subclass of: BackboneElement
title: Contained content

_subscriber
type: ObjectProperty
comment: (Modified) Coverage.subscriber

workflowStatus
type: ObjectProperty
comment: ArtifactAssessment.workflowStatus: Indicates the workflow status of the comment or change request.
modifierExtensionProperty: _workflowStatus
title: ArtifactAssessment.workflowStatus: submitted | triaged | waiting-for-input | resolved-no-change | resolved-change-required | deferred | duplicate | applied | published | entered-in-error

phylum
type: ObjectProperty
comment: SubstanceSourceMaterial.organism.organismGeneral.phylum: The phylum of an organism shall be specified.
modifierExtensionProperty: _phylum
title: SubstanceSourceMaterial.organism.organismGeneral.phylum: The phylum of an organism shall be specified

_mustSupport
type: ObjectProperty
comment: (Modified) ElementDefinition.mustSupport
comment: (Modified) DataRequirement.mustSupport

forecastStatus
type: ObjectProperty
comment: ImmunizationRecommendation.recommendation.forecastStatus: Indicates the patient status with respect to the path to immunity for the target disease.
modifierExtensionProperty: _forecastStatus
title: ImmunizationRecommendation.recommendation.forecastStatus: Vaccine recommendation status

_closure
type: ObjectProperty
comment: (Modified) TerminologyCapabilities.closure

_abstract
type: ObjectProperty
comment: (Modified) ValueSet.expansion.contains.contains.abstract
comment: (Modified) ValueSet.expansion.contains.abstract
comment: (Modified) StructureDefinition.abstract
comment: (Modified) Citation.citedArtifact.abstract

relatedClinicalInformation
type: ObjectProperty
comment: MedicationStatement.relatedClinicalInformation: Link to information that is relevant to a medication statement, for example, illicit drug use, gestational age, etc.
modifierExtensionProperty: relatedClinicalInformation
title: MedicationStatement.relatedClinicalInformation: Link to information relevant to the usage of a medication

PersonCommunicationComponent
type: Class
comment: PersonCommunicationComponent: A language which may be used to communicate with the person about his or her health.
subclass of: BackboneElement
subclass of: Restriction
  max cardinality: 1
  on property: preferred
subclass of: Restriction
  all values from: boolean
  on property: preferred
subclass of: Restriction
  cardinality: 1
  on property: language
subclass of: Restriction
  all values from: CodeableConcept
  on property: language

_relativePath
type: ObjectProperty
comment: (Modified) ImplementationGuide.manifest.resource.relativePath

CitationCitedArtifactVersionComponent
type: Class
comment: CitationCitedArtifactComponent.CitationCitedArtifactVersionComponent: The defined version of the cited artifact.
subclass of: BackboneElement
subclass of: Restriction
  max cardinality: 1
  on property: baseCitation
subclass of: Restriction
  all values from: Reference
  on property: baseCitation
subclass of: Restriction
  cardinality: 1
  on property: value
subclass of: Restriction
  all values from: string
  on property: value

_paging
type: ObjectProperty
comment: (Modified) TerminologyCapabilities.expansion.paging

_uniqueId
type: ObjectProperty
comment: (Modified) NamingSystem.uniqueId

_readOnly
type: ObjectProperty
comment: (Modified) Questionnaire.item.item.readOnly
comment: (Modified) Questionnaire.item.readOnly

_jurisdiction
type: ObjectProperty
comment: (Modified) DeviceDefinition.packaging.packaging.udiDeviceIdentifier.jurisdiction
comment: (Modified) SubstanceDefinition.name.synonym.jurisdiction
comment: (Modified) Library.jurisdiction
comment: (Modified) DeviceDefinition.regulatoryIdentifier.jurisdiction
comment: (Modified) PlanDefinition.jurisdiction
comment: (Modified) SpecimenDefinition.jurisdiction
comment: (Modified) DeviceDefinition.udiDeviceIdentifier.jurisdiction
comment: (Modified) TestPlan.jurisdiction
comment: (Modified) ValueSet.jurisdiction
comment: (Modified) SubstanceDefinition.name.jurisdiction
comment: (Modified) CanonicalResource.jurisdiction
comment: (Modified) ConditionDefinition.jurisdiction
comment: (Modified) ConceptMap.jurisdiction
comment: (Modified) MessageDefinition.jurisdiction
comment: (Modified) PackagedProductDefinition.legalStatusOfSupply.jurisdiction
comment: (Modified) MedicinalProductDefinition.name.usage.jurisdiction
comment: (Modified) EventDefinition.jurisdiction
comment: (Modified) ImplementationGuide.jurisdiction
comment: (Modified) Measure.jurisdiction
comment: (Modified) DeviceDefinition.packaging.udiDeviceIdentifier.jurisdiction
comment: (Modified) StructureMap.jurisdiction
comment: (Modified) StructureDefinition.jurisdiction
comment: (Modified) NamingSystem.jurisdiction
comment: (Modified) SubstanceDefinition.name.translation.jurisdiction
comment: (Modified) TerminologyCapabilities.jurisdiction
comment: (Modified) ChargeItemDefinition.jurisdiction
comment: (Modified) Device.udiCarrier.jurisdiction
comment: (Modified) TestScript.jurisdiction
comment: (Modified) CapabilityStatement.jurisdiction
comment: (Modified) ActorDefinition.jurisdiction
comment: (Modified) ExampleScenario.jurisdiction
comment: (Modified) OperationDefinition.jurisdiction
comment: (Modified) GraphDefinition.jurisdiction
comment: (Modified) CodeSystem.jurisdiction
comment: (Modified) SubscriptionTopic.jurisdiction
comment: (Modified) Questionnaire.jurisdiction
comment: (Modified) Citation.jurisdiction
comment: (Modified) ActivityDefinition.jurisdiction
comment: (Modified) Requirements.jurisdiction
comment: (Modified) ObservationDefinition.jurisdiction
comment: (Modified) SearchParameter.jurisdiction
comment: (Modified) MarketingStatus.jurisdiction

_treatment
type: ObjectProperty
comment: (Modified) ClinicalUseDefinition.indication.otherTherapy.treatment
comment: (Modified) ClinicalUseDefinition.contraindication.otherTherapy.treatment

_responsibleParty
type: ObjectProperty
comment: (Modified) MedicationDispense.substitution.responsibleParty

RequestOrchestrationActionComponentActionAction
type: Class
comment: Sub actions.
subclass of: BackboneElement
title: Sub action

_role
type: ObjectProperty
comment: (Modified) PlanDefinition.action.action.participant.role
comment: (Modified) Contract.term.group.offer.party.role
comment: (Modified) Consent.provision.actor.role
comment: (Modified) Claim.careTeam.role
comment: (Modified) ResearchStudy.associatedParty.role
comment: (Modified) CareTeam.participant.role
comment: (Modified) SubstanceDefinition.moiety.role
comment: (Modified) AuditEvent.entity.agent.role
comment: (Modified) InventoryItem.responsibleOrganization.role
comment: (Modified) ConditionDefinition.plan.role
comment: (Modified) AuditEvent.agent.role
comment: (Modified) ActivityDefinition.participant.role
comment: (Modified) Specimen.role
comment: (Modified) Consent.provision.provision.actor.role
comment: (Modified) AuditEvent.entity.role
comment: (Modified) Provenance.agent.role
comment: (Modified) RequestOrchestration.action.participant.role
comment: (Modified) ExplanationOfBenefit.careTeam.role
comment: (Modified) Provenance.entity.agent.role
comment: (Modified) Provenance.entity.role
comment: (Modified) PlanDefinition.action.participant.role
comment: (Modified) PlanDefinition.actor.option.role
comment: (Modified) Ingredient.manufacturer.role
comment: (Modified) Invoice.participant.role
comment: (Modified) Ingredient.role
comment: (Modified) GenomicStudy.analysis.performer.role
comment: (Modified) Contract.term.group.action.subject.role
comment: (Modified) RequestOrchestration.action.action.participant.role
comment: (Modified) Citation.citedArtifact.contributorship.entry.role
comment: (Modified) Contract.term.offer.party.role
comment: (Modified) Contract.term.action.subject.role

TestPlanDependencyComponent
type: Class
comment: TestPlanDependencyComponent: The required criteria to execute the test plan - e.g. preconditions, previous tests...
subclass of: BackboneElement
subclass of: Restriction
  max cardinality: 1
  on property: predecessor
subclass of: Restriction
  all values from: Reference
  on property: predecessor
subclass of: Restriction
  max cardinality: 1
  on property: description
subclass of: Restriction
  all values from: markdown
  on property: description

Binary
type: Class
comment: A resource that represents the data of a single raw artifact as digital content accessible in its native format. A Binary resource can contain any content, whether text, image, pdf, zip archive, etc.
subclass of: infrastructure.structure
subclass of: Resource
subclass of: Restriction
  all values from: code
  on property: contentType
subclass of: Restriction
  all values from: Reference
  on property: securityContext
subclass of: Restriction
  all values from: base64Binary
  on property: data
subclass of: Restriction
  cardinality: 1
  on property: contentType
subclass of: Restriction
  max cardinality: 1
  on property: securityContext
subclass of: Restriction
  max cardinality: 1
  on property: data

contentDerivative
type: ObjectProperty
comment: Contract.contentDerivative: The minimal content derived from the basal information source at a specific stage in its lifecycle.
sub property of: what
modifierExtensionProperty: contentDerivative
title: Contract.contentDerivative: Content derived from the basal information

inforce
type: ObjectProperty
comment: CoverageEligibilityResponse.insurance.inforce: Flag indicating if the coverage provided is inforce currently if no service date(s) specified or for the whole duration of the service dates.
modifierExtensionProperty: _inforce
title: CoverageEligibilityResponse.insurance.inforce: Coverage inforce indicator

RiskAssessmentPredictionComponent
type: Class
comment: RiskAssessmentPredictionComponent: Describes the expected outcome for the subject.
subclass of: BackboneElement
subclass of: Restriction
  all values from: decimal
  on property: relativeRisk
subclass of: Restriction
  all values from: string
  on property: rationale
subclass of: Restriction
  all values from: CodeableConcept
  on property: outcome
subclass of: Restriction
  max cardinality: 1
  on property: rationale
subclass of: Restriction
  max cardinality: 1
  on property: qualitativeRisk
subclass of:
  union of: Restriction
    all values from: decimal
    on property: probability
  union of: Restriction
    max cardinality: 1
    on property: probability
  union of: Restriction
    all values from: Range
    on property: probability
  union of: Restriction
    max cardinality: 1
    on property: probability
subclass of: Restriction
  all values from: CodeableConcept
  on property: qualitativeRisk
subclass of: Restriction
  max cardinality: 1
  on property: outcome
subclass of:
  union of: Restriction
    all values from: Period
    on property: when
  union of: Restriction
    max cardinality: 1
    on property: when
  union of: Restriction
    all values from: Range
    on property: when
  union of: Restriction
    max cardinality: 1
    on property: when
subclass of: Restriction
  max cardinality: 1
  on property: relativeRisk

_enteredDate
type: ObjectProperty
comment: (Modified) ChargeItem.enteredDate

_legalStatusOfSupply
type: ObjectProperty
comment: (Modified) PackagedProductDefinition.legalStatusOfSupply
comment: (Modified) MedicinalProductDefinition.legalStatusOfSupply

valueAlternatives
type: ObjectProperty
comment: ElementDefinition.valueAlternatives: Specifies a list of extensions that can appear in place of a primitive value.
modifierExtensionProperty: valueAlternatives
title: ElementDefinition.valueAlternatives: Extensions that are allowed to replace a primitive value

subject
type: ObjectProperty
comment: Account.subject: Identifies the entity which incurs the expenses. While the immediate recipients of services or goods might be entities related to the subject, the expenses were ultimately incurred by the subject of the Account.
comment: Flag.subject: The patient, related person, location, group, organization, or practitioner etc. this is about record this flag is associated with.
comment: Appointment.subject: The patient or group associated with the appointment, if they are to be present (usually) then they should also be included in the participant backbone element.
comment: Measure.subject
comment: CarePlan.subject: Identifies the patient or group whose intended care is described by the plan.
comment: GenomicStudy.subject: The primary subject of the genomic study.
comment: Encounter.subject: The patient or group related to this encounter. In some use-cases the patient MAY not be present, such as a case meeting about a patient between several practitioners or a careteam.
comment: MolecularSequence.subject: Indicates the subject this sequence is associated too.
comment: DocumentReference.subject: Who or what the document is about. The document can be about a person, (patient or healthcare practitioner), a device (e.g. a machine) or even a group of subjects (such as a document about a herd of farm animals, or a set of patients that share a common exposure).
comment: EventDefinition.subject
comment: RiskAssessment.subject: The patient or group the risk assessment applies to.
comment: PlanDefinition.action.action.subject
comment: PlanDefinition.subject
comment: NutritionIntake.subject: The person, animal or group who is/was consuming the food or fluid.
comment: GuidanceResponse.subject: The patient for which the request was processed.
comment: Observation.subject: The patient, or group of patients, location, device, organization, procedure or practitioner this observation is about and into whose or what record the observation is placed. If the actual focus of the observation is different from the subject (or a sample of, part, or region of the subject), the `focus` element or the `code` itself specifies the actual focus of the observation.
comment: MedicationStatement.subject: The person, animal or group who is/was taking the medication.
comment: ActivityDefinition.subject
comment: DataRequirement.subject
comment: RequestOrchestration.subject: The subject for which the request orchestration was created.
comment: ResearchSubject.subject: The record of the person, animal or other entity involved in the study.
comment: SpecimenDefinition.subject
comment: DiagnosticReport.subject: The subject of the report. Usually, but not always, this is a patient. However, diagnostic services also perform analyses on specimens collected from a variety of other sources.
comment: MedicationAdministration.subject: The person or animal or group receiving the medication.
comment: ClinicalImpression.subject: The patient or group of individuals assessed as part of this record.
comment: CommunicationRequest.subject: The patient or group that is the focus of this communication request.
comment: ObservationDefinition.subject: A code that describes the intended kind of subject of Observation instances conforming to this ObservationDefinition.
comment: EvidenceReport.subject: Specifies the subject or focus of the report. Answers "What is this report about?".
comment: Procedure.subject: On whom or on what the procedure was performed. This is usually an individual human, but can also be performed on animals, groups of humans or animals, organizations or practitioners (for licensing), locations or devices (for safety inspections or regulatory authorizations). If the actual focus of the procedure is different from the subject, the focus element specifies the actual focus of the procedure.
comment: DeviceRequest.subject: The patient who will use the device.
comment: NutritionOrder.subject: The person or set of individuals who needs the nutrition order for an oral diet, nutritional supplement and/or enteral or formula feeding.
comment: ImagingStudy.subject: The subject, typically a patient, of the imaging study.
comment: DeviceAssociation.subject: The individual, group of individuals or device that the device is on or associated with.
comment: QuestionnaireResponse.subject: The subject of the questionnaire response. This could be a patient, organization, practitioner, device, etc. This is who/what the answers apply to, but is not necessarily the source of information.
comment: MeasureReport.subject: Optional subject identifying the individual or individuals the report is for.
comment: Composition.subject: Who or what the composition is about. The composition can be about a person, (patient or healthcare practitioner), a device (e.g. a machine) or even a group of subjects (such as a document about a herd of livestock, or a set of patients that share a common exposure).
comment: Condition.subject: Indicates the patient or group who the condition record is associated with.
comment: Basic.subject: Identifies the patient, practitioner, device or any other resource that is the "focus" of this resource.
comment: Consent.subject: The patient/healthcare practitioner or group of persons to whom this consent applies.
comment: MedicationDispense.subject: A link to a resource representing the person or the group to whom the medication will be given.
comment: MedicationRequest.subject: The individual or group for whom the medication has been requested.
comment: ImagingSelection.subject: The patient, or group of patients, location, device, organization, procedure or practitioner this imaging selection is about and into whose or what record the imaging selection is placed.
comment: Library.subject
comment: Measure.group.subject
comment: MeasureReport.group.subject: Optional subject identifying the individual or individuals the report is for.
comment: RegulatedAuthorization.subject: The product type, treatment, facility or activity that is being authorized.
comment: EncounterHistory.subject: The patient or group related to this encounter. In some use-cases the patient MAY not be present, such as a case meeting about a patient between several practitioners or a careteam.
comment: Contract.term.group.action.subject: Entity of the action.
comment: ClinicalUseDefinition.subject: The medication, product, substance, device, procedure etc. for which this is an indication.
comment: InventoryItem.instance.subject: The subject that the item is associated with.
comment: Contract.term.action.subject: Entity of the action.
comment: DetectedIssue.subject: Indicates the subject whose record the detected issue is associated with.
comment: PlanDefinition.action.subject
comment: DeviceDispense.subject: A link to a resource representing the person to whom the device is intended.
comment: List.subject: The common subject(s) (or patient(s)) of the resources that are in the list if there is one (or a set of subjects).
comment: Invoice.subject: The individual or set of individuals receiving the goods and services billed in this invoice.
comment: ServiceRequest.subject: On whom or what the service is to be performed. This is usually a human patient, but can also be requested on animals, groups of humans or animals, devices such as dialysis machines, or even locations (typically for environmental scans).
comment: CareTeam.subject: Identifies the patient or group whose intended care is handled by the team.
comment: Communication.subject: The patient or group that was the focus of this communication.
comment: Goal.subject: Identifies the patient, group or organization for whom the goal is being established.
comment: Contract.subject: The target entity impacted by or of interest to parties to the agreement.
comment: AdverseEvent.subject: This subject or group impacted by the event.
comment: Specimen.subject: Where the specimen came from. This may be from patient(s), from a location (e.g., the source of an environmental sample), or a sampling of a substance, a biologically-derived product, or a device.
comment: ChargeItem.subject: The individual or set of individuals the action is being or was performed on.
sub property of: who.focus
sub property of: who
modifierExtensionProperty: _subject
title: Contract.term.group.action.subject: Entity of the action
title: ClinicalImpression.subject: Patient or group assessed
title: MolecularSequence.subject: Subject this sequence is associated too
title: AdverseEvent.subject: Subject impacted by event
title: GuidanceResponse.subject: Patient the request was performed for
title: EvidenceReport.subject: Focus of the report
title: DetectedIssue.subject: Associated subject
title: DeviceDispense.subject: Who the dispense is for
title: ResearchSubject.subject: Who or what is part of study
title: RiskAssessment.subject: Who/what does assessment apply to?
title: DeviceRequest.subject: Focus of request
title: QuestionnaireResponse.subject: The subject of the questions

_publicationDate
type: ObjectProperty
comment: (Modified) Contract.contentDefinition.publicationDate
comment: (Modified) RelatedArtifact.publicationDate

occurrenceChanged
type: ObjectProperty
comment: Appointment.occurrenceChanged: This appointment varies from the recurring pattern.
modifierExtensionProperty: occurrenceChanged
title: Appointment.occurrenceChanged: Indicates that this appointment varies from a recurrence pattern

_referralRequest
type: ObjectProperty
comment: (Modified) EpisodeOfCare.referralRequest

friday
type: ObjectProperty
comment: Appointment.recurrenceTemplate.weeklyTemplate.friday: Indicates that recurring appointments should occur on Fridays.
modifierExtensionProperty: _friday
title: Appointment.recurrenceTemplate.weeklyTemplate.friday: Recurs on Friday

productType
type: ObjectProperty
comment: MedicationKnowledge.productType: Category of the medication or product (e.g. branded product, therapeutic moeity, generic product, innovator product, etc.).
modifierExtensionProperty: _productType
title: MedicationKnowledge.productType: Category of the medication or product

_payeeType
type: ObjectProperty
comment: (Modified) ClaimResponse.payeeType

_fixed
type: ObjectProperty
comment: (Modified) ElementDefinition.fixed

_nTerminalModification
type: ObjectProperty
comment: (Modified) SubstanceProtein.subunit.nTerminalModification

_progressStatus
type: ObjectProperty
comment: (Modified) ResearchStudy.progressStatus

_age
type: ObjectProperty
comment: (Modified) ObservationDefinition.component.qualifiedValue.age
comment: (Modified) ObservationDefinition.qualifiedValue.age
comment: (Modified) Observation.component.referenceRange.age
comment: (Modified) Observation.referenceRange.age
comment: (Modified) FamilyMemberHistory.age

_verificationDate
type: ObjectProperty
comment: (Modified) Consent.verification.verificationDate

CompartmentDefinitionResourceComponent
type: Class
comment: CompartmentDefinitionResourceComponent: Information about how a resource is related to the compartment.
subclass of: BackboneElement
subclass of: Restriction
  max cardinality: 1
  on property: startParam
subclass of: Restriction
  all values from: uri
  on property: startParam
subclass of: Restriction
  max cardinality: 1
  on property: documentation
subclass of: Restriction
  max cardinality: 1
  on property: endParam
subclass of: Restriction
  all values from: uri
  on property: endParam
subclass of: Restriction
  all values from: code
  on property: code
subclass of: Restriction
  cardinality: 1
  on property: code
subclass of: Restriction
  all values from: string
  on property: documentation
subclass of: Restriction
  all values from: string
  on property: param

_questionnaire
type: ObjectProperty
comment: (Modified) QuestionnaireResponse.questionnaire
comment: (Modified) ConditionDefinition.questionnaire

TestScript
type: Class
comment: A structured set of tests against a FHIR server or client implementation to determine compliance against the FHIR specification.
subclass of: conformance.misc
subclass of: CanonicalResource
subclass of: Restriction
  all values from: string
  on property: title
subclass of: Restriction
  max cardinality: 1
  on property: version
subclass of: Restriction
  all values from: TestScriptSetupComponent
  on property: setup
subclass of: Restriction
  max cardinality: 1
  on property: description
subclass of: Restriction
  max cardinality: 1
  on property: setup
subclass of:
  union of: Restriction
    all values from: string
    on property: versionAlgorithm
  union of: Restriction
    max cardinality: 1
    on property: versionAlgorithm
  union of: Restriction
    all values from: Coding
    on property: versionAlgorithm
  union of: Restriction
    max cardinality: 1
    on property: versionAlgorithm
subclass of: Restriction
  all values from: string
  on property: name
subclass of: Restriction
  cardinality: 1
  on property: status
subclass of: Restriction
  max cardinality: 1
  on property: publisher
subclass of: Restriction
  all values from: TestScriptScopeComponent
  on property: scope
subclass of: Restriction
  max cardinality: 1
  on property: metadata
subclass of: Restriction
  cardinality: 1
  on property: name
subclass of: Restriction
  all values from: canonical
  on property: profile
subclass of: Restriction
  all values from: TestScriptVariableComponent
  on property: variable
subclass of: Restriction
  max cardinality: 1
  on property: copyrightLabel
subclass of: Restriction
  all values from: TestScriptTestComponent
  on property: test
subclass of: Restriction
  all values from: uri
  on property: url
subclass of: Restriction
  max cardinality: 1
  on property: copyright
subclass of: Restriction
  all values from: CodeableConcept
  on property: jurisdiction
subclass of: Restriction
  all values from: string
  on property: publisher
subclass of: Restriction
  all values from: string
  on property: copyrightLabel
subclass of: Restriction
  max cardinality: 1
  on property: title
subclass of: Restriction
  max cardinality: 1
  on property: url
subclass of: Restriction
  all values from: code
  on property: status
subclass of: Restriction
  all values from: dateTime
  on property: date
subclass of: Restriction
  all values from: markdown
  on property: description
subclass of: Restriction
  all values from: markdown
  on property: copyright
subclass of: Restriction
  all values from: TestScriptTeardownComponent
  on property: teardown
subclass of: Restriction
  all values from: UsageContext
  on property: useContext
subclass of: Restriction
  all values from: TestScriptMetadataComponent
  on property: metadata
subclass of: Restriction
  all values from: TestScriptOriginComponent
  on property: origin
subclass of: Restriction
  all values from: markdown
  on property: purpose
subclass of: Restriction
  max cardinality: 1
  on property: teardown
subclass of: Restriction
  all values from: boolean
  on property: experimental
subclass of: Restriction
  max cardinality: 1
  on property: purpose
subclass of: Restriction
  all values from: TestScriptFixtureComponent
  on property: fixture
subclass of: Restriction
  max cardinality: 1
  on property: date
subclass of: Restriction
  max cardinality: 1
  on property: experimental
subclass of: Restriction
  all values from: Identifier
  on property: identifier
subclass of: Restriction
  all values from: TestScriptDestinationComponent
  on property: destination
subclass of: Restriction
  all values from: ContactDetail
  on property: contact
subclass of: Restriction
  all values from: string
  on property: version

billingStatus
type: ObjectProperty
comment: Account.billingStatus: The BillingStatus tracks the lifecycle of the account through the billing process. It indicates how transactions are treated when they are allocated to the account.
modifierExtensionProperty: billingStatus
title: Account.billingStatus: Tracks the lifecycle of the account through the billing process

_resourceTrigger
type: ObjectProperty
comment: (Modified) SubscriptionTopic.resourceTrigger

compose
type: ObjectProperty
comment: ValueSet.compose: A set of criteria that define the contents of the value set by including or excluding codes selected from the specified code system(s) that the value set draws from. This is also known as the Content Logical Definition (CLD).
modifierExtensionProperty: _compose
title: ValueSet.compose: Content logical definition of the value set (CLD)

_submitter
type: ObjectProperty
comment: (Modified) PaymentReconciliation.allocation.submitter

_productReference
type: ObjectProperty
comment: (Modified) InventoryItem.productReference

payment
type: ObjectProperty
comment: ClaimResponse.payment: Payment details for the adjudication of the claim.
comment: ExplanationOfBenefit.payment: Payment details for the adjudication of the claim.
comment: Contract.term.group.asset.valuedItem.payment: Terms of valuation.
comment: Contract.term.asset.valuedItem.payment: Terms of valuation.
comment: PaymentNotice.payment: A reference to the payment which is the subject of this notice.
modifierExtensionProperty: _payment
title: ClaimResponse.payment: Payment Details
title: Contract.term.group.asset.valuedItem.payment: Terms of valuation
title: Contract.term.asset.valuedItem.payment: Terms of valuation
title: PaymentNotice.payment: Payment reference
title: ExplanationOfBenefit.payment: Payment Details

rateAggregation
type: ObjectProperty
comment: Measure.group.rateAggregation: Describes how to combine the information calculated, based on logic in each of several populations, into one summarized result.
comment: Measure.rateAggregation: Describes how to combine the information calculated, based on logic in each of several populations, into one summarized result.
modifierExtensionProperty: rateAggregation
title: Measure.group.rateAggregation: How is rate aggregation performed for this measure
title: Measure.rateAggregation: How is rate aggregation performed for this measure

OrganizationQualificationComponent
type: Class
comment: OrganizationQualificationComponent: The official certifications, accreditations, training, designations and licenses that authorize and/or otherwise endorse the provision of care by the organization. For example, an approval to provide a type of services issued by a certifying body (such as the US Joint Commission) to an organization.
subclass of: BackboneElement
subclass of: Restriction
  all values from: Period
  on property: period
subclass of: Restriction
  all values from: Reference
  on property: issuer
subclass of: Restriction
  max cardinality: 1
  on property: issuer
subclass of: Restriction
  cardinality: 1
  on property: code
subclass of: Restriction
  all values from: Identifier
  on property: identifier
subclass of: Restriction
  max cardinality: 1
  on property: period
subclass of: Restriction
  all values from: CodeableConcept
  on property: code

identityCertificate
type: ObjectProperty
comment: VerificationResult.validator.identityCertificate: A digital identity certificate associated with the validator.
modifierExtensionProperty: identityCertificate
title: VerificationResult.validator.identityCertificate: A digital identity certificate associated with the validator

_subDetail
type: ObjectProperty
comment: (Modified) ExplanationOfBenefit.addItem.detail.subDetail
comment: (Modified) ExplanationOfBenefit.item.detail.subDetail
comment: (Modified) ClaimResponse.addItem.detail.subDetail
comment: (Modified) ClaimResponse.item.detail.subDetail
comment: (Modified) Claim.item.detail.subDetail

contextInvariant
type: ObjectProperty
comment: StructureDefinition.contextInvariant: A set of rules as FHIRPath Invariants about when the extension can be used (e.g. co-occurrence variants for the extension). All the rules must be true.
modifierExtensionProperty: contextInvariant
title: StructureDefinition.contextInvariant: FHIRPath invariants - when the extension can be used

_suffix
type: ObjectProperty
comment: (Modified) HumanName.suffix

_recurrenceId
type: ObjectProperty
comment: (Modified) AppointmentResponse.recurrenceId
comment: (Modified) Appointment.recurrenceId

dispenseInterval
type: ObjectProperty
comment: MedicationRequest.dispenseRequest.dispenseInterval: The minimum period of time that must occur between dispenses of the medication.
modifierExtensionProperty: dispenseInterval
title: MedicationRequest.dispenseRequest.dispenseInterval: Minimum period of time between dispenses

_map
type: ObjectProperty
comment: (Modified) ElementDefinition.mapping.map

_lensSpecification
type: ObjectProperty
comment: (Modified) VisionPrescription.lensSpecification

allergyIntolerance
type: ObjectProperty
comment: NutritionOrder.allergyIntolerance: A link to a record of allergies or intolerances which should be included in the nutrition order.
modifierExtensionProperty: allergyIntolerance
title: NutritionOrder.allergyIntolerance: List of the patient's food and nutrition-related allergies and intolerances

asset
type: ObjectProperty
comment: Contract.term.group.asset: Contract Term Asset List.
comment: Contract.term.asset: Contract Term Asset List.
modifierExtensionProperty: asset
title: Contract.term.group.asset: Contract Term Asset List
title: Contract.term.asset: Contract Term Asset List

CoverageEligibilityResponse
type: Class
comment: This resource provides eligibility and plan details from the processing of an CoverageEligibilityRequest resource.
subclass of: financial.support
subclass of: DomainResource
subclass of: Restriction
  all values from: Reference
  on property: requestor
subclass of: Restriction
  all values from: Errors
  on property: error
subclass of: Restriction
  max cardinality: 1
  on property: requestor
subclass of: Restriction
  cardinality: 1
  on property: insurer
subclass of: Restriction
  cardinality: 1
  on property: request
subclass of: Restriction
  all values from: Insurance
  on property: insurance
subclass of: Restriction
  max cardinality: 1
  on property: disposition
subclass of: Restriction
  all values from: dateTime
  on property: created
subclass of: Restriction
  cardinality: 1
  on property: outcome
subclass of: Restriction
  cardinality: 1
  on property: created
subclass of: Restriction
  min cardinality: 1
  on property: purpose
subclass of: Restriction
  all values from: Reference
  on property: insurer
subclass of:
  union of: Restriction
    all values from: date
    on property: serviced
  union of: Restriction
    max cardinality: 1
    on property: serviced
  union of: Restriction
    all values from: Period
    on property: serviced
  union of: Restriction
    max cardinality: 1
    on property: serviced
subclass of: Restriction
  max cardinality: 1
  on property: preAuthRef
subclass of: Restriction
  all values from: string
  on property: disposition
subclass of: Restriction
  all values from: code
  on property: status
subclass of: Restriction
  all values from: Reference
  on property: request
subclass of: Restriction
  all values from: CodeableConcept
  on property: form
subclass of: Restriction
  all values from: string
  on property: preAuthRef
subclass of: Restriction
  all values from: code
  on property: outcome
subclass of: Restriction
  all values from: Identifier
  on property: identifier
subclass of: Restriction
  cardinality: 1
  on property: status
subclass of: Restriction
  cardinality: 1
  on property: patient
subclass of: Restriction
  all values from: Reference
  on property: patient
subclass of: Restriction
  all values from: CoverageEligibilityResponseEventComponent
  on property: event
subclass of: Restriction
  max cardinality: 1
  on property: form
subclass of: Restriction
  all values from: code
  on property: purpose
modifierExtensionClass: CoverageEligibilityResponse

OperationDefinitionParameterComponentParameter
type: Class
comment: The parts of a nested Parameter.
subclass of: BackboneElement
subclass of: Restriction
  all values from: markdown
  on property: documentation
subclass of: Restriction
  cardinality: 1
  on property: use
subclass of: Restriction
  all values from: code
  on property: type
subclass of: Restriction
  cardinality: 1
  on property: max
subclass of: Restriction
  all values from: code
  on property: name
subclass of: Restriction
  max cardinality: 1
  on property: binding
subclass of: Restriction
  all values from: code
  on property: searchType
subclass of: Restriction
  all values from: OperationDefinitionParameterReferencedFromComponent
  on property: referencedFrom
subclass of: Restriction
  all values from: OperationDefinitionParameterBindingComponent
  on property: binding
subclass of: Restriction
  all values from: code
  on property: use
subclass of: Restriction
  cardinality: 1
  on property: name
subclass of: Restriction
  cardinality: 1
  on property: min
subclass of: Restriction
  all values from: code
  on property: scope
subclass of: Restriction
  max cardinality: 1
  on property: type
subclass of: Restriction
  all values from: OperationDefinitionParameterComponentParameterParameter
  on property: part
subclass of: Restriction
  all values from: string
  on property: max
subclass of: Restriction
  all values from: code
  on property: allowedType
subclass of: Restriction
  max cardinality: 1
  on property: documentation
subclass of: Restriction
  max cardinality: 1
  on property: searchType
subclass of: Restriction
  all values from: canonical
  on property: targetProfile
subclass of: Restriction
  all values from: integer
  on property: min
title: Parts of a nested Parameter

packagedMedicinalProduct
type: ObjectProperty
comment: MedicinalProductDefinition.packagedMedicinalProduct: Package type for the product. See also the PackagedProductDefinition resource.
modifierExtensionProperty: packagedMedicinalProduct
title: MedicinalProductDefinition.packagedMedicinalProduct: Package type for the product

_count
type: ObjectProperty
comment: (Modified) DeviceDefinition.packaging.packaging.count
comment: (Modified) MeasureReport.group.population.count
comment: (Modified) CodeSystem.count
comment: (Modified) DeviceDefinition.chargeItem.count
comment: (Modified) DeviceDefinition.packaging.count
comment: (Modified) MeasureReport.group.stratifier.stratum.population.count
comment: (Modified) DeviceDefinition.hasPart.count
comment: (Modified) Timing.repeat.count

SubstancePolymerRepeatRepeatUnitDegreeOfPolymerisationComponent
type: Class
comment: SubstancePolymerRepeatComponent.SubstancePolymerRepeatRepeatUnitComponent.SubstancePolymerRepeatRepeatUnitDegreeOfPolymerisationComponent: Applies to homopolymer and block co-polymers where the degree of polymerisation within a block can be described.
subclass of: BackboneElement
subclass of: Restriction
  all values from: integer
  on property: low
subclass of: Restriction
  all values from: integer
  on property: high
subclass of: Restriction
  max cardinality: 1
  on property: type
subclass of: Restriction
  all values from: CodeableConcept
  on property: type
subclass of: Restriction
  max cardinality: 1
  on property: high
subclass of: Restriction
  max cardinality: 1
  on property: average
subclass of: Restriction
  max cardinality: 1
  on property: low
subclass of: Restriction
  all values from: integer
  on property: average

adjudication
type: ObjectProperty
comment: ExplanationOfBenefit.adjudication: The adjudication results which are presented at the header level rather than at the line-item or add-item levels.
comment: ClaimResponse.item.detail.subDetail.adjudication: The adjudication results.
comment: ClaimResponse.addItem.adjudication: The adjudication results.
comment: ExplanationOfBenefit.item.adjudication: If this item is a group then the values here are a summary of the adjudication of the detail items. If this item is a simple product or service then this is the result of the adjudication of this item.
comment: ClaimResponse.item.detail.adjudication: The adjudication results.
comment: ExplanationOfBenefit.addItem.detail.adjudication: The adjudication results.
comment: ClaimResponse.item.adjudication: If this item is a group then the values here are a summary of the adjudication of the detail items. If this item is a simple product or service then this is the result of the adjudication of this item.
comment: ClaimResponse.addItem.detail.subDetail.adjudication: The adjudication results.
comment: ExplanationOfBenefit.addItem.adjudication: The adjudication results.
comment: ExplanationOfBenefit.item.detail.adjudication: The adjudication results.
comment: ClaimResponse.adjudication: The adjudication results which are presented at the header level rather than at the line-item or add-item levels.
comment: ClaimResponse.addItem.detail.adjudication: The adjudication results.
comment: ExplanationOfBenefit.addItem.detail.subDetail.adjudication: The adjudication results.
comment: ExplanationOfBenefit.item.detail.subDetail.adjudication: The adjudication results.
modifierExtensionProperty: adjudication
title: ExplanationOfBenefit.item.detail.subDetail.adjudication: Subdetail level adjudication details
title: ClaimResponse.item.detail.adjudication: Detail level adjudication details
title: ClaimResponse.addItem.detail.adjudication: Added items detail adjudication
title: ExplanationOfBenefit.addItem.adjudication: Added items adjudication
title: ClaimResponse.item.detail.subDetail.adjudication: Subdetail level adjudication details
title: ClaimResponse.item.adjudication: Adjudication details
title: ClaimResponse.adjudication: Header-level adjudication
title: ExplanationOfBenefit.adjudication: Header-level adjudication
title: ClaimResponse.addItem.detail.subDetail.adjudication: Added items subdetail adjudication
title: ExplanationOfBenefit.addItem.detail.adjudication: Added items adjudication
title: ExplanationOfBenefit.item.detail.adjudication: Detail level adjudication details
title: ClaimResponse.addItem.adjudication: Added items adjudication
title: ExplanationOfBenefit.item.adjudication: Adjudication details
title: ExplanationOfBenefit.addItem.detail.subDetail.adjudication: Added items adjudication

RequestOrchestrationActionConditionComponent
type: Class
comment: RequestOrchestrationActionComponentAction.RequestOrchestrationActionConditionComponent: An expression that describes applicability criteria, or start/stop conditions for the action.
comment: RequestOrchestrationActionComponent.RequestOrchestrationActionConditionComponent: An expression that describes applicability criteria, or start/stop conditions for the action.
subclass of: BackboneElement
subclass of: Restriction
  max cardinality: 1
  on property: expression
subclass of: Restriction
  all values from: Expression
  on property: expression
subclass of: Restriction
  all values from: Expression
  on property: expression
subclass of: Restriction
  all values from: code
  on property: kind
subclass of: Restriction
  max cardinality: 1
  on property: expression
subclass of: Restriction
  all values from: code
  on property: kind
subclass of: Restriction
  cardinality: 1
  on property: kind
subclass of: Restriction
  cardinality: 1
  on property: kind

validator
type: ObjectProperty
comment: VerificationResult.validator: Information about the entity validating information.
modifierExtensionProperty: validator
title: VerificationResult.validator: Information about the entity validating information

_gene
type: ObjectProperty
comment: (Modified) SubstanceReferenceInformation.gene.gene
comment: (Modified) SubstanceReferenceInformation.gene

_length
type: ObjectProperty
comment: (Modified) SubstanceProtein.subunit.length
comment: (Modified) SubstanceNucleicAcid.subunit.length
comment: (Modified) EncounterHistory.length
comment: (Modified) Encounter.length

series
type: ObjectProperty
comment: ImmunizationEvaluation.series: One possible path to achieve presumed immunity against a disease - within the context of an authority.
comment: ImagingStudy.series: Each study has one or more series of images or other content.
comment: ImmunizationRecommendation.recommendation.series: One possible path to achieve presumed immunity against a disease - within the context of an authority.
comment: Immunization.protocolApplied.series: One possible path to achieve presumed immunity against a disease - within the context of an authority.
modifierExtensionProperty: _series
title: ImmunizationEvaluation.series: Name of vaccine series
title: ImagingStudy.series: Each study has one or more series of instances
title: Immunization.protocolApplied.series: Name of vaccine series
title: ImmunizationRecommendation.recommendation.series: Name of vaccination series

maxDosePerAdministration
type: ObjectProperty
comment: Dosage.maxDosePerAdministration: Upper limit on medication per administration.
modifierExtensionProperty: maxDosePerAdministration
title: Dosage.maxDosePerAdministration: Upper limit on medication per administration

_performerRole
type: ObjectProperty
comment: (Modified) Contract.term.group.action.performerRole
comment: (Modified) Contract.term.action.performerRole

_balance
type: ObjectProperty
comment: (Modified) Account.balance

_correctiveAction
type: ObjectProperty
comment: (Modified) DeviceDefinition.correctiveAction

dispenser
type: ObjectProperty
comment: MedicationRequest.dispenseRequest.dispenser: Indicates the intended performing Organization that will dispense the medication as specified by the prescriber.
sub property of: who
modifierExtensionProperty: _dispenser
title: MedicationRequest.dispenseRequest.dispenser: Intended performer of dispense

NutritionOrderOralDietComponent
type: Class
comment: NutritionOrderOralDietComponent: Diet given orally in contrast to enteral (tube) feeding.
subclass of: BackboneElement
subclass of: Restriction
  max cardinality: 1
  on property: schedule
subclass of: Restriction
  all values from: NutritionOrderOralDietTextureComponent
  on property: texture
subclass of: Restriction
  all values from: string
  on property: instruction
subclass of: Restriction
  all values from: OralDietSchedule
  on property: schedule
subclass of: Restriction
  max cardinality: 1
  on property: instruction
subclass of: Restriction
  all values from: NutritionOrderOralDietNutrientComponent
  on property: nutrient
subclass of: Restriction
  all values from: CodeableConcept
  on property: fluidConsistencyType
subclass of: Restriction
  all values from: CodeableConcept
  on property: type

_meaning
type: ObjectProperty
comment: (Modified) Permission.rule.data.resource.meaning
comment: (Modified) Consent.provision.provision.data.meaning
comment: (Modified) Consent.provision.data.meaning

endParam
type: ObjectProperty
comment: CompartmentDefinition.resource.endParam: Search Parameter for mapping requests made with $everything.end (e.g. on [Patient.$everything](patient-operation-everything.html)).
modifierExtensionProperty: endParam
title: CompartmentDefinition.resource.endParam: Search Param for interpreting $everything.end

_provider
type: ObjectProperty
comment: (Modified) CoverageEligibilityRequest.item.provider
comment: (Modified) ClaimResponse.addItem.provider
comment: (Modified) CoverageEligibilityRequest.provider
comment: (Modified) ExplanationOfBenefit.provider
comment: (Modified) ExplanationOfBenefit.addItem.provider
comment: (Modified) CoverageEligibilityResponse.insurance.item.provider
comment: (Modified) EnrollmentRequest.provider
comment: (Modified) Claim.careTeam.provider
comment: (Modified) Claim.provider
comment: (Modified) ExplanationOfBenefit.careTeam.provider

inResponseTo
type: ObjectProperty
comment: Communication.inResponseTo: Prior communication that this communication is in response to.
modifierExtensionProperty: inResponseTo
title: Communication.inResponseTo: Reply to

authorDescription
type: ObjectProperty
comment: SubstanceSourceMaterial.organism.author.authorDescription: The author of an organism species shall be specified. The author year of an organism shall also be specified when applicable; refers to the year in which the first author(s) published the infraspecific plant/animal name (of any rank).
modifierExtensionProperty: authorDescription
title: SubstanceSourceMaterial.organism.author.authorDescription: The author of an organism species shall be specified. The author year of an organism shall also be specified when applicable; refers to the year in which the first author(s) published the infraspecific plant/animal name (of any rank)

_intendedExposure
type: ObjectProperty
comment: (Modified) ResearchStudy.comparisonGroup.intendedExposure

_cycle
type: ObjectProperty
comment: (Modified) Device.cycle

ProvenanceEntityComponentAgent
type: Class
comment: The entity is attributed to an agent to express the agent's responsibility for that entity, possibly along with other agents. This description can be understood as shorthand for saying that the agent was responsible for the activity which used the entity.
subclass of: BackboneElement
subclass of: Restriction
  max cardinality: 1
  on property: type
subclass of: Restriction
  all values from: CodeableConcept
  on property: type
subclass of: Restriction
  max cardinality: 1
  on property: onBehalfOf
subclass of: Restriction
  all values from: Reference
  on property: onBehalfOf
subclass of: Restriction
  cardinality: 1
  on property: who
subclass of: Restriction
  all values from: CodeableConcept
  on property: role
subclass of: Restriction
  all values from: Reference
  on property: who
title: Entity is attributed to this agent

high
type: ObjectProperty
comment: Range.high: The high limit. The boundary is inclusive.
comment: SubstancePolymer.repeat.repeatUnit.degreeOfPolymerisation.high: A high expected limit of the amount.
comment: Observation.component.referenceRange.high: The value of the high bound of the reference range. The high bound of the reference range endpoint is inclusive of the value (e.g. reference range is >=5 - <=9). If the high bound is omitted, it is assumed to be meaningless (e.g. reference range is >= 2.3).
comment: Observation.referenceRange.high: The value of the high bound of the reference range. The high bound of the reference range endpoint is inclusive of the value (e.g. reference range is >=5 - <=9). If the high bound is omitted, it is assumed to be meaningless (e.g. reference range is >= 2.3).
modifierExtensionProperty: high
title: SubstancePolymer.repeat.repeatUnit.degreeOfPolymerisation.high: A high expected limit of the amount
title: Observation.referenceRange.high: High Range, if relevant
title: Observation.component.referenceRange.high: High Range, if relevant
title: Range.high: High limit

_paymentStatus
type: ObjectProperty
comment: (Modified) PaymentNotice.paymentStatus

TestScriptVariableComponent
type: Class
comment: TestScriptVariableComponent: Variable is set based either on element value in response body or on header field value in the response headers.
subclass of: BackboneElement
subclass of: Restriction
  max cardinality: 1
  on property: path
subclass of: Restriction
  cardinality: 1
  on property: name
subclass of: Restriction
  max cardinality: 1
  on property: sourceId
subclass of: Restriction
  all values from: id
  on property: sourceId
subclass of: Restriction
  all values from: string
  on property: name
subclass of: Restriction
  all values from: string
  on property: path
subclass of: Restriction
  all values from: string
  on property: hint
subclass of: Restriction
  max cardinality: 1
  on property: defaultValue
subclass of: Restriction
  all values from: string
  on property: headerField
subclass of: Restriction
  max cardinality: 1
  on property: headerField
subclass of: Restriction
  all values from: string
  on property: defaultValue
subclass of: Restriction
  all values from: string
  on property: description
subclass of: Restriction
  max cardinality: 1
  on property: description
subclass of: Restriction
  all values from: string
  on property: expression
subclass of: Restriction
  max cardinality: 1
  on property: hint
subclass of: Restriction
  max cardinality: 1
  on property: expression

_comparator
type: ObjectProperty
comment: (Modified) SubstanceDefinition.relationship.comparator
comment: (Modified) SubscriptionTopic.canFilterBy.comparator
comment: (Modified) Subscription.filterBy.comparator
comment: (Modified) SearchParameter.comparator
comment: (Modified) Quantity.comparator
comment: (Modified) DataRequirement.valueFilter.comparator

_instantiatesCanonical
type: ObjectProperty
comment: (Modified) Transport.instantiatesCanonical
comment: (Modified) NutritionOrder.instantiatesCanonical
comment: (Modified) GenomicStudy.instantiatesCanonical
comment: (Modified) Task.instantiatesCanonical
comment: (Modified) CarePlan.instantiatesCanonical
comment: (Modified) DeviceRequest.instantiatesCanonical
comment: (Modified) Contract.instantiatesCanonical
comment: (Modified) NutritionIntake.instantiatesCanonical
comment: (Modified) GenomicStudy.analysis.instantiatesCanonical
comment: (Modified) Communication.instantiatesCanonical
comment: (Modified) FamilyMemberHistory.instantiatesCanonical
comment: (Modified) RequestOrchestration.instantiatesCanonical
comment: (Modified) Procedure.instantiatesCanonical
comment: (Modified) ServiceRequest.instantiatesCanonical

class
type: ObjectProperty
comment: EncounterHistory.class: Concepts representing classification of patient encounter such as ambulatory (outpatient), inpatient, emergency, home health or others due to local variations.
comment: Appointment.class: Concepts representing classification of patient encounter such as ambulatory (outpatient), inpatient, emergency, home health or others due to local variations.
comment: SubstanceSourceMaterial.organism.organismGeneral.class: The class of an organism shall be specified.
comment: SubstancePolymer.class: Overall type of the polymer.
comment: Coverage.class: A suite of underwriter specific classifiers.
comment: Encounter.class: Concepts representing classification of patient encounter such as ambulatory (outpatient), inpatient, emergency, home health or others due to local variations.
sub property of: class
modifierExtensionProperty: class
title: Appointment.class: Classification when becoming an encounter
title: SubstancePolymer.class: Overall type of the polymer
title: Coverage.class: Additional coverage classifications
title: Encounter.class: Classification of patient encounter context - e.g. Inpatient, outpatient
title: EncounterHistory.class: Classification of patient encounter
title: SubstanceSourceMaterial.organism.organismGeneral.class: The class of an organism shall be specified

_countryOfOrigin
type: ObjectProperty
comment: (Modified) SubstanceSourceMaterial.countryOfOrigin
comment: (Modified) SubstanceDefinition.sourceMaterial.countryOfOrigin

structuralRepresentation
type: ObjectProperty
comment: SubstancePolymer.repeat.repeatUnit.structuralRepresentation: A graphical structure for this SRU.
modifierExtensionProperty: structuralRepresentation
title: SubstancePolymer.repeat.repeatUnit.structuralRepresentation: A graphical structure for this SRU

_communicationMethod
type: ObjectProperty
comment: (Modified) VerificationResult.attestation.communicationMethod
comment: (Modified) VerificationResult.primarySource.communicationMethod

_size
type: ObjectProperty
comment: (Modified) Attachment.size

_averageMolecularFormula
type: ObjectProperty
comment: (Modified) SubstancePolymer.repeat.averageMolecularFormula

_ingredientLabel
type: ObjectProperty
comment: (Modified) NutritionIntake.ingredientLabel

_landmarkDescription
type: ObjectProperty
comment: (Modified) BodyStructure.excludedStructure.bodyLandmarkOrientation.landmarkDescription
comment: (Modified) BodyStructure.includedStructure.bodyLandmarkOrientation.landmarkDescription

_criticalCodedValueSet
type: ObjectProperty
comment: (Modified) ObservationDefinition.component.qualifiedValue.criticalCodedValueSet
comment: (Modified) ObservationDefinition.qualifiedValue.criticalCodedValueSet

unmapped
type: ObjectProperty
comment: ConceptMap.group.unmapped: What to do when there is no mapping to a target concept from the source concept and ConceptMap.group.element.noMap is not true. This provides the "default" to be applied when there is no target concept mapping specified or the expansion of ConceptMap.group.element.target.valueSet is empty.
modifierExtensionProperty: unmapped
title: ConceptMap.group.unmapped: What to do when there is no mapping target for the source concept and ConceptMap.group.element.noMap is not true

_productCategory
type: ObjectProperty
comment: (Modified) BiologicallyDerivedProduct.productCategory

SubstanceReferenceInformationTargetComponent
type: Class
comment: SubstanceReferenceInformationTargetComponent: Todo.
subclass of: BackboneElement
subclass of: Restriction
  max cardinality: 1
  on property: target
subclass of: Restriction
  all values from: CodeableConcept
  on property: organism
subclass of: Restriction
  max cardinality: 1
  on property: type
subclass of: Restriction
  max cardinality: 1
  on property: organism
subclass of: Restriction
  max cardinality: 1
  on property: organismType
subclass of: Restriction
  all values from: CodeableConcept
  on property: interaction
subclass of: Restriction
  all values from: Reference
  on property: source
subclass of: Restriction
  all values from: CodeableConcept
  on property: organismType
subclass of: Restriction
  all values from: CodeableConcept
  on property: type
subclass of: Restriction
  max cardinality: 1
  on property: interaction
subclass of: Restriction
  all values from: Identifier
  on property: target
subclass of: Restriction
  max cardinality: 1
  on property: amountType
subclass of: Restriction
  all values from: CodeableConcept
  on property: amountType
subclass of:
  union of: Restriction
    all values from: Quantity
    on property: amount
  union of: Restriction
    max cardinality: 1
    on property: amount
  union of: Restriction
    all values from: Range
    on property: amount
  union of: Restriction
    max cardinality: 1
    on property: amount
  union of: Restriction
    all values from: string
    on property: amount
  union of: Restriction
    max cardinality: 1
    on property: amount

_preferredReportName
type: ObjectProperty
comment: (Modified) ObservationDefinition.preferredReportName

QuestionnaireResponseItemComponent.QuestionnaireResponseItemAnswerComponentItem
type: Class
comment: Nested groups and/or questions found within this particular answer.
subclass of: BackboneElement
subclass of: Restriction
  all values from: QuestionnaireResponseItemComponent.QuestionnaireResponseItemAnswerComponentItemItem
  on property: item
subclass of: Restriction
  all values from: string
  on property: linkId
subclass of: Restriction
  all values from: QuestionnaireResponseItemAnswerComponent
  on property: answer
subclass of: Restriction
  max cardinality: 1
  on property: text
subclass of: Restriction
  max cardinality: 1
  on property: definition
subclass of: Restriction
  cardinality: 1
  on property: linkId
subclass of: Restriction
  all values from: string
  on property: text
subclass of: Restriction
  all values from: uri
  on property: definition
title: Child items of question

_maternalOrganismId
type: ObjectProperty
comment: (Modified) SubstanceSourceMaterial.organism.hybrid.maternalOrganismId

_order
type: ObjectProperty
comment: (Modified) SubstanceSourceMaterial.organism.organismGeneral.order
comment: (Modified) Coverage.order

qualifier
type: ObjectProperty
comment: BodyStructure.excludedStructure.qualifier: Code that represents the included structure qualifier.
comment: BodyStructure.includedStructure.qualifier: Code that represents the included structure qualifier.
sub property of: what
modifierExtensionProperty: qualifier
title: BodyStructure.excludedStructure.qualifier: Code that represents the included structure qualifier
title: BodyStructure.includedStructure.qualifier: Code that represents the included structure qualifier

recruitment
type: ObjectProperty
comment: ResearchStudy.recruitment: Target or actual group of participants enrolled in study.
sub property of: who.focus
modifierExtensionProperty: _recruitment
title: ResearchStudy.recruitment: Target or actual group of participants enrolled in study

mitigation
type: ObjectProperty
comment: RiskAssessment.mitigation: A description of the steps that might be taken to reduce the identified risk(s).
comment: DetectedIssue.mitigation: Indicates an action that has been taken or is committed to reduce or eliminate the likelihood of the risk identified by the detected issue from manifesting. Can also reflect an observation of known mitigating factors that may reduce/eliminate the need for any action.
modifierExtensionProperty: _mitigation
title: RiskAssessment.mitigation: How to reduce risk
title: DetectedIssue.mitigation: Step taken to address

Procedure
type: Class
comment: An action that is or was performed on or for a patient, practitioner, device, organization, or location. For example, this can be a physical intervention on a patient like an operation, or less invasive like long term services, counseling, or hypnotherapy. This can be a quality or safety inspection for a location, organization, or device. This can be an accreditation procedure on a practitioner for licensing.
comment: ExplanationOfBenefit.Procedure: Procedures performed on the patient relevant to the billing items with the claim.
comment: Claim.Procedure: Procedures performed on the patient relevant to the billing items with the claim.
subclass of: DomainResource
subclass of: clinical.general
subclass of: BackboneElement
subclass of: Restriction
  max cardinality: 1
  on property: encounter
subclass of: Restriction
  all values from: CodeableConcept
  on property: category
subclass of: Restriction
  all values from: Annotation
  on property: note
subclass of: Restriction
  all values from: Reference
  on property: location
subclass of: Restriction
  all values from: CodeableConcept
  on property: outcome
subclass of: Restriction
  all values from: CodeableConcept
  on property: statusReason
subclass of: Restriction
  all values from: canonical
  on property: instantiatesCanonical
subclass of: Restriction
  max cardinality: 1
  on property: location
subclass of: Restriction
  cardinality: 1
  on property: subject
subclass of: Restriction
  all values from: dateTime
  on property: recorded
subclass of: Restriction
  all values from: code
  on property: status
subclass of: Restriction
  all values from: Reference
  on property: basedOn
subclass of: Restriction
  all values from: Reference
  on property: udi
subclass of: Restriction
  all values from: CodeableReference
  on property: reason
subclass of: Restriction
  all values from: ProcedureFocalDeviceComponent
  on property: focalDevice
subclass of: Restriction
  cardinality: 1
  on property: sequence
subclass of: Restriction
  max cardinality: 1
  on property: statusReason
subclass of: Restriction
  all values from: CodeableConcept
  on property: followUp
subclass of: Restriction
  max cardinality: 1
  on property: recorded
subclass of:
  union of: Restriction
    all values from: boolean
    on property: reported
  union of: Restriction
    max cardinality: 1
    on property: reported
  union of: Restriction
    all values from: Reference
    on property: reported
  union of: Restriction
    max cardinality: 1
    on property: reported
subclass of: Restriction
  max cardinality: 1
  on property: recorder
subclass of: Restriction
  all values from: Identifier
  on property: identifier
subclass of: Restriction
  all values from: CodeableConcept
  on property: type
subclass of: Restriction
  all values from: positiveInt
  on property: sequence
subclass of: Restriction
  all values from: Reference
  on property: recorder
subclass of: Restriction
  all values from: CodeableConcept
  on property: code
subclass of: Restriction
  max cardinality: 1
  on property: date
subclass of: Restriction
  all values from: Reference
  on property: encounter
subclass of: Restriction
  max cardinality: 1
  on property: focus
subclass of: Restriction
  all values from: dateTime
  on property: date
subclass of: Restriction
  all values from: uri
  on property: instantiatesUri
subclass of:
  union of: Restriction
    all values from: CodeableConcept
    on property: procedure
  union of: Restriction
    cardinality: 1
    on property: procedure
  union of: Restriction
    all values from: Reference
    on property: procedure
  union of: Restriction
    cardinality: 1
    on property: procedure
subclass of: Restriction
  all values from: Reference
  on property: udi
subclass of: Restriction
  all values from: Reference
  on property: supportingInfo
subclass of: Restriction
  all values from: Reference
  on property: report
subclass of: Restriction
  cardinality: 1
  on property: sequence
subclass of: Restriction
  all values from: ProcedurePerformerComponent
  on property: performer
subclass of: Restriction
  all values from: CodeableReference
  on property: used
subclass of: Restriction
  cardinality: 1
  on property: status
subclass of: Restriction
  all values from: Reference
  on property: partOf
subclass of: Restriction
  all values from: positiveInt
  on property: sequence
subclass of:
  union of: Restriction
    all values from: CodeableConcept
    on property: procedure
  union of: Restriction
    cardinality: 1
    on property: procedure
  union of: Restriction
    all values from: Reference
    on property: procedure
  union of: Restriction
    cardinality: 1
    on property: procedure
subclass of: Restriction
  all values from: CodeableConcept
  on property: type
subclass of: Restriction
  all values from: CodeableReference
  on property: complication
subclass of: Restriction
  all values from: Reference
  on property: subject
subclass of: Restriction
  max cardinality: 1
  on property: outcome
subclass of: Restriction
  all values from: CodeableConcept
  on property: bodySite
subclass of: Restriction
  all values from: dateTime
  on property: date
subclass of: Restriction
  all values from: Reference
  on property: focus
subclass of: Restriction
  max cardinality: 1
  on property: date
subclass of: Restriction
  max cardinality: 1
  on property: code
subclass of:
  union of: Restriction
    all values from: dateTime
    on property: occurrence
  union of: Restriction
    max cardinality: 1
    on property: occurrence
  union of: Restriction
    all values from: Period
    on property: occurrence
  union of: Restriction
    max cardinality: 1
    on property: occurrence
modifierExtensionClass: Procedure

material
type: ObjectProperty
comment: PackagedProductDefinition.packaging.material: Material type of the package item.
comment: PackagedProductDefinition.packaging.packaging.material: Material type of the package item.
comment: SpecimenDefinition.typeTested.container.material: The type of material of the container.
comment: DeviceDefinition.material: A substance used to create the material(s) of which the device is made.
modifierExtensionProperty: material
title: PackagedProductDefinition.packaging.material: Material type of the package item
title: DeviceDefinition.material: A substance used to create the material(s) of which the device is made
title: PackagedProductDefinition.packaging.packaging.material: Material type of the package item
title: SpecimenDefinition.typeTested.container.material: The material type used for the container

_packageId
type: ObjectProperty
comment: (Modified) ImplementationGuide.dependsOn.packageId
comment: (Modified) ImplementationGuide.packageId

address
type: ObjectProperty
comment: Practitioner.address: Address(es) of the practitioner that are not role specific (typically home address). Work addresses are not typically entered in this property as they are usually role dependent.
comment: VirtualServiceDetail.address
comment: Endpoint.address: The uri that describes the actual end-point to connect to.
comment: Patient.contact.address: Address for the contact person.
comment: Patient.address: An address for the individual.
comment: Person.address: One or more addresses for the person.
comment: ExtendedContactDetail.address: Address for the contact.
comment: RelatedPerson.address: Address where the related person can be contacted or visited.
comment: CapabilityStatement.messaging.endpoint.address: The network address of the endpoint. For solutions that do not use network addresses for routing, it can be just an identifier.
comment: Location.address: Physical location.
modifierExtensionProperty: address
title: Endpoint.address: The technical base address for connecting to this endpoint
title: ExtendedContactDetail.address: Address for the contact
title: RelatedPerson.address: Address where the related person can be contacted or visited
title: Person.address: One or more addresses for the person
title: Patient.contact.address: Address for the contact person
title: Location.address: Physical location
title: Practitioner.address: Address(es) of the practitioner that are not role specific (typically home address)
title: Patient.address: An address for the individual
title: CapabilityStatement.messaging.endpoint.address: Network address or identifier of the end-point

module
type: ObjectProperty
comment: GuidanceResponse.module
modifierExtensionProperty: _module

SubstanceNucleicAcidSubunitComponent
type: Class
comment: SubstanceNucleicAcidSubunitComponent: Subunits are listed in order of decreasing length; sequences of the same length will be ordered by molecular weight; subunits that have identical sequences will be repeated multiple times.
subclass of: BackboneElement
subclass of: Restriction
  all values from: SubstanceNucleicAcidSubunitLinkageComponent
  on property: linkage
subclass of: Restriction
  max cardinality: 1
  on property: sequence
subclass of: Restriction
  all values from: Attachment
  on property: sequenceAttachment
subclass of: Restriction
  all values from: CodeableConcept
  on property: threePrime
subclass of: Restriction
  all values from: integer
  on property: subunit
subclass of: Restriction
  all values from: string
  on property: sequence
subclass of: Restriction
  max cardinality: 1
  on property: threePrime
subclass of: Restriction
  max cardinality: 1
  on property: fivePrime
subclass of: Restriction
  all values from: CodeableConcept
  on property: fivePrime
subclass of: Restriction
  max cardinality: 1
  on property: length
subclass of: Restriction
  max cardinality: 1
  on property: subunit
subclass of: Restriction
  all values from: SubstanceNucleicAcidSubunitSugarComponent
  on property: sugar
subclass of: Restriction
  max cardinality: 1
  on property: sequenceAttachment
subclass of: Restriction
  all values from: integer
  on property: length

_healthcareService
type: ObjectProperty
comment: (Modified) PractitionerRole.healthcareService
comment: (Modified) OrganizationAffiliation.healthcareService

check
type: ObjectProperty
comment: StructureMap.group.rule.rule.source.check: FHIRPath expression - must be true or the mapping engine throws an error instead of completing.
comment: StructureMap.group.rule.source.check: FHIRPath expression - must be true or the mapping engine throws an error instead of completing.
modifierExtensionProperty: check
title: StructureMap.group.rule.rule.source.check: FHIRPath expression - must be true or the mapping engine throws an error instead of completing
title: StructureMap.group.rule.source.check: FHIRPath expression - must be true or the mapping engine throws an error instead of completing

_serviceProvisionCode
type: ObjectProperty
comment: (Modified) HealthcareService.serviceProvisionCode

DeviceDefinitionHasPartComponent
type: Class
comment: DeviceDefinitionHasPartComponent: A device that is part (for example a component) of the present device.
subclass of: BackboneElement
subclass of: Restriction
  max cardinality: 1
  on property: count
subclass of: Restriction
  all values from: integer
  on property: count
subclass of: Restriction
  cardinality: 1
  on property: reference
subclass of: Restriction
  all values from: Reference
  on property: reference

hybrid
type: ObjectProperty
comment: SubstanceSourceMaterial.organism.hybrid: 4.9.13.8.1 Hybrid species maternal organism ID (Optional).
modifierExtensionProperty: hybrid
title: SubstanceSourceMaterial.organism.hybrid: 4.9.13.8.1 Hybrid species maternal organism ID (Optional)

DeviceDefinitionPackagingComponentPackaging
type: Class
comment: Allows packages within packages.
subclass of: BackboneElement
subclass of: Restriction
  all values from: Identifier
  on property: identifier
subclass of: Restriction
  all values from: integer
  on property: count
subclass of: Restriction
  max cardinality: 1
  on property: type
subclass of: Restriction
  all values from: CodeableConcept
  on property: type
subclass of: Restriction
  all values from: DeviceDefinitionPackagingComponentPackagingUdiDeviceIdentifier
  on property: udiDeviceIdentifier
subclass of: Restriction
  max cardinality: 1
  on property: identifier
subclass of: Restriction
  all values from: DeviceDefinitionPackagingComponentPackagingPackaging
  on property: packaging
subclass of: Restriction
  all values from: PackagingDistributor
  on property: distributor
subclass of: Restriction
  max cardinality: 1
  on property: count
title: Allows packages within packages

extends
type: ObjectProperty
comment: StructureMap.group.extends: Another group that this group adds rules to.
modifierExtensionProperty: extends
title: StructureMap.group.extends: Another group that this group adds rules to

AdverseEventSupportingInfoComponent
type: Class
comment: AdverseEventSupportingInfoComponent: Supporting information relevant to the event.
subclass of: BackboneElement
subclass of:
  union of: Restriction
    all values from: Reference
    on property: item
  union of: Restriction
    cardinality: 1
    on property: item
  union of: Restriction
    all values from: CodeableConcept
    on property: item
  union of: Restriction
    cardinality: 1
    on property: item

_MedicationRequest
type: Class
comment: (Modified) MedicationRequest
subclass of: DomainResource

startingSequence
type: ObjectProperty
comment: MolecularSequence.relative.startingSequence: A sequence that is used as a starting sequence to describe variants that are present in a sequence analyzed.
modifierExtensionProperty: startingSequence
title: MolecularSequence.relative.startingSequence: A sequence used as starting sequence

MedicationKnowledgeMonographComponent
type: Class
comment: MedicationKnowledgeMonographComponent: Associated documentation about the medication.
subclass of: BackboneElement
subclass of: Restriction
  max cardinality: 1
  on property: source
subclass of: Restriction
  all values from: Reference
  on property: source
subclass of: Restriction
  max cardinality: 1
  on property: type
subclass of: Restriction
  all values from: CodeableConcept
  on property: type

DetectedIssue
type: Class
comment: Indicates an actual or potential clinical issue with or between one or more active or proposed clinical actions for a patient; e.g. Drug-drug interaction, Ineffective treatment frequency, Procedure-condition conflict, gaps in care, etc.
subclass of: DomainResource
subclass of: clinical.general
subclass of: Restriction
  all values from: uri
  on property: reference
subclass of: Restriction
  all values from: Reference
  on property: author
subclass of: Restriction
  all values from: DetectedIssueMitigationComponent
  on property: mitigation
subclass of: Restriction
  max cardinality: 1
  on property: code
subclass of: Restriction
  all values from: Reference
  on property: encounter
subclass of: Restriction
  all values from: Identifier
  on property: identifier
subclass of: Restriction
  all values from: CodeableConcept
  on property: code
subclass of: Restriction
  max cardinality: 1
  on property: detail
subclass of: Restriction
  max cardinality: 1
  on property: encounter
subclass of: Restriction
  all values from: DetectedIssueEvidenceComponent
  on property: evidence
subclass of:
  union of: Restriction
    all values from: dateTime
    on property: identified
  union of: Restriction
    max cardinality: 1
    on property: identified
  union of: Restriction
    all values from: Period
    on property: identified
  union of: Restriction
    max cardinality: 1
    on property: identified
subclass of: Restriction
  all values from: markdown
  on property: detail
subclass of: Restriction
  cardinality: 1
  on property: status
subclass of: Restriction
  max cardinality: 1
  on property: severity
subclass of: Restriction
  all values from: code
  on property: status
subclass of: Restriction
  all values from: code
  on property: severity
subclass of: Restriction
  max cardinality: 1
  on property: author
subclass of: Restriction
  all values from: Reference
  on property: subject
subclass of: Restriction
  max cardinality: 1
  on property: reference
subclass of: Restriction
  all values from: Reference
  on property: implicated
subclass of: Restriction
  all values from: CodeableConcept
  on property: category
subclass of: Restriction
  max cardinality: 1
  on property: subject
modifierExtensionClass: DetectedIssue

targetLocation
type: ObjectProperty
comment: VerificationResult.targetLocation: The fhirpath location(s) within the resource that was validated.
modifierExtensionProperty: _targetLocation
title: VerificationResult.targetLocation: The fhirpath location(s) within the resource that was validated

MedicinalProductDefinitionCrossReferenceComponent
type: Class
comment: MedicinalProductDefinitionCrossReferenceComponent: Reference to another product, e.g. for linking authorised to investigational product, or a virtual product.
subclass of: BackboneElement
subclass of: Restriction
  max cardinality: 1
  on property: type
subclass of: Restriction
  all values from: CodeableConcept
  on property: type
subclass of: Restriction
  cardinality: 1
  on property: product
subclass of: Restriction
  all values from: CodeableReference
  on property: product

_alternateMaterial
type: ObjectProperty
comment: (Modified) PackagedProductDefinition.packaging.packaging.alternateMaterial
comment: (Modified) PackagedProductDefinition.packaging.alternateMaterial

_ordered
type: ObjectProperty
comment: (Modified) ElementDefinition.slicing.ordered

_List
type: Class
comment: (Modified) List
subclass of: DomainResource

_gateway
type: ObjectProperty
comment: (Modified) Device.gateway

_effect
type: ObjectProperty
comment: (Modified) ClinicalUseDefinition.interaction.effect

_coordinate
type: ObjectProperty
comment: (Modified) ImagingSelection.instance.imageRegion3D.coordinate
comment: (Modified) ImagingSelection.instance.imageRegion2D.coordinate

case
type: ObjectProperty
comment: RegulatedAuthorization.case: The case or regulatory procedure for granting or amending a regulated authorization. An authorization is granted in response to submissions/applications by those seeking authorization. A case is the administrative process that deals with the application(s) that relate to this and assesses them. Note: This area is subject to ongoing review and the workgroup is seeking implementer feedback on its use (see link at bottom of page).
modifierExtensionProperty: _case
title: RegulatedAuthorization.case: The case or regulatory procedure for granting or amending a regulated authorization. Note: This area is subject to ongoing review and the workgroup is seeking implementer feedback on its use (see link at bottom of page)

QuestionnaireItemComponentItem
type: Class
comment: Text, questions and other groups to be nested beneath a question or group.
subclass of: BackboneElement
subclass of: Restriction
  all values from: canonical
  on property: answerValueSet
subclass of: Restriction
  all values from: boolean
  on property: repeats
subclass of: Restriction
  all values from: string
  on property: linkId
subclass of: Restriction
  all values from: boolean
  on property: readOnly
subclass of: Restriction
  max cardinality: 1
  on property: answerConstraint
subclass of: Restriction
  max cardinality: 1
  on property: enableBehavior
subclass of: Restriction
  max cardinality: 1
  on property: definition
subclass of: Restriction
  all values from: uri
  on property: definition
subclass of: Restriction
  all values from: code
  on property: type
subclass of: Restriction
  cardinality: 1
  on property: linkId
subclass of: Restriction
  all values from: code
  on property: enableBehavior
subclass of: Restriction
  all values from: QuestionnaireItemAnswerOptionComponent
  on property: answerOption
subclass of: Restriction
  max cardinality: 1
  on property: maxLength
subclass of: Restriction
  all values from: code
  on property: disabledDisplay
subclass of: Restriction
  all values from: QuestionnaireItemEnableWhenComponent
  on property: enableWhen
subclass of: Restriction
  all values from: boolean
  on property: required
subclass of: Restriction
  max cardinality: 1
  on property: disabledDisplay
subclass of: Restriction
  all values from: QuestionnaireItemComponentItemItem
  on property: item
subclass of: Restriction
  max cardinality: 1
  on property: text
subclass of: Restriction
  max cardinality: 1
  on property: answerValueSet
subclass of: Restriction
  cardinality: 1
  on property: type
subclass of: Restriction
  all values from: integer
  on property: maxLength
subclass of: Restriction
  max cardinality: 1
  on property: required
subclass of: Restriction
  max cardinality: 1
  on property: repeats
subclass of: Restriction
  all values from: code
  on property: answerConstraint
subclass of: Restriction
  all values from: Coding
  on property: code
subclass of: Restriction
  max cardinality: 1
  on property: prefix
subclass of: Restriction
  all values from: string
  on property: text
subclass of: Restriction
  all values from: QuestionnaireItemInitialComponent
  on property: initial
subclass of: Restriction
  max cardinality: 1
  on property: readOnly
subclass of: Restriction
  all values from: string
  on property: prefix
title: Nested questionnaire items

DeviceConformsToComponent
type: Class
comment: DeviceConformsToComponent: Identifies the standards, specifications, or formal guidances for the capabilities supported by the device. The device may be certified as conformant to these specifications e.g., communication, performance, process, measurement, or specialization standards.
subclass of: BackboneElement
subclass of: Restriction
  all values from: CodeableConcept
  on property: specification
subclass of: Restriction
  max cardinality: 1
  on property: category
subclass of: Restriction
  all values from: CodeableConcept
  on property: category
subclass of: Restriction
  all values from: string
  on property: version
subclass of: Restriction
  max cardinality: 1
  on property: version
subclass of: Restriction
  cardinality: 1
  on property: specification

PatientLinkComponent
type: Class
comment: PatientLinkComponent: Link to a Patient or RelatedPerson resource that concerns the same actual individual.
subclass of: BackboneElement
subclass of: Restriction
  cardinality: 1
  on property: type
subclass of: Restriction
  all values from: code
  on property: type
subclass of: Restriction
  cardinality: 1
  on property: other
subclass of: Restriction
  all values from: Reference
  on property: other

testData
type: ObjectProperty
comment: TestPlan.testCase.testData: The test data used in the test case.
modifierExtensionProperty: testData
title: TestPlan.testCase.testData: The test data used in the test case

ProcedureFocalDeviceComponent
type: Class
comment: ProcedureFocalDeviceComponent: A device that is implanted, removed or otherwise manipulated (calibration, battery replacement, fitting a prosthesis, attaching a wound-vac, etc.) as a focal portion of the Procedure.
subclass of: BackboneElement
subclass of: Restriction
  cardinality: 1
  on property: manipulated
subclass of: Restriction
  all values from: Reference
  on property: manipulated
subclass of: Restriction
  max cardinality: 1
  on property: action
subclass of: Restriction
  all values from: CodeableConcept
  on property: action

_typeCanonical
type: ObjectProperty
comment: (Modified) RequestOrchestration.action.action.participant.typeCanonical
comment: (Modified) RequestOrchestration.action.participant.typeCanonical
comment: (Modified) PlanDefinition.action.action.participant.typeCanonical
comment: (Modified) PlanDefinition.action.participant.typeCanonical
comment: (Modified) PlanDefinition.actor.option.typeCanonical
comment: (Modified) ActivityDefinition.participant.typeCanonical

nodeId
type: ObjectProperty
comment: GraphDefinition.node.nodeId: Internal ID of node - target for link references.
modifierExtensionProperty: _nodeId
title: GraphDefinition.node.nodeId: Internal ID - target for link references

CapabilityStatementSoftwareComponent
type: Class
comment: CapabilityStatementSoftwareComponent: Software that is covered by this capability statement. It is used when the capability statement describes the capabilities of a particular software version, independent of an installation.
subclass of: BackboneElement
subclass of: Restriction
  all values from: string
  on property: version
subclass of: Restriction
  cardinality: 1
  on property: name
subclass of: Restriction
  max cardinality: 1
  on property: version
subclass of: Restriction
  max cardinality: 1
  on property: releaseDate
subclass of: Restriction
  all values from: string
  on property: name
subclass of: Restriction
  all values from: dateTime
  on property: releaseDate

_preparation
type: ObjectProperty
comment: (Modified) SpecimenDefinition.typeTested.container.preparation

_subType
type: ObjectProperty
comment: (Modified) ExplanationOfBenefit.subType
comment: (Modified) Contract.term.group.subType
comment: (Modified) Contract.term.subType
comment: (Modified) Contract.contentDefinition.subType
comment: (Modified) Contract.subType
comment: (Modified) ClaimResponse.subType
comment: (Modified) Claim.subType

_definitionCodeableConcept
type: ObjectProperty
comment: (Modified) EvidenceVariable.characteristic.definitionByCombination.characteristic.definitionCodeableConcept
comment: (Modified) EvidenceVariable.characteristic.definitionCodeableConcept

benefitBalance
type: ObjectProperty
comment: ExplanationOfBenefit.benefitBalance: Balance by Benefit Category.
modifierExtensionProperty: _benefitBalance
title: ExplanationOfBenefit.benefitBalance: Balance by Benefit Category

exclusionCriteria
type: ObjectProperty
comment: ValueSet.scope.exclusionCriteria: Criteria describing which concepts or codes should be excluded and why.
modifierExtensionProperty: exclusionCriteria
title: ValueSet.scope.exclusionCriteria: Criteria describing which concepts or codes should be excluded and why

numberOfStudies
type: ObjectProperty
comment: Evidence.statistic.sampleSize.numberOfStudies: Number of participants in the population.
modifierExtensionProperty: numberOfStudies
title: Evidence.statistic.sampleSize.numberOfStudies: Number of contributing studies

start
type: ObjectProperty
comment: MolecularSequence.relative.edit.start: Start position of the edit on the starting sequence. If the coordinate system is either 0-based or 1-based, then start position is inclusive.
comment: AppointmentResponse.start: Date/Time that the appointment is to take place, or requested new start time.
comment: GraphDefinition.start: The Node at which instances of this graph start. If there is no nominated start, the graph can start at any of the nodes.
comment: PlanDefinition.goal.start: The event after which the goal should begin being pursued.
comment: Period.start: The start of the period. The boundary is inclusive.
comment: Goal.start
comment: Appointment.start: Date/Time that the appointment is to take place.
comment: Slot.start: Date/Time that the slot is to begin.
sub property of: when.planned
sub property of: when.init
modifierExtensionProperty: start
title: AppointmentResponse.start: Time from appointment, or requested new start time
title: MolecularSequence.relative.edit.start: Start position of the edit on the starting sequence
title: PlanDefinition.goal.start: When goal pursuit begins
title: Slot.start: Date/Time that the slot is to begin
title: Appointment.start: When appointment is to take place
title: GraphDefinition.start: Starting Node
title: Period.start: Starting time with inclusive boundary

AccountRelatedAccountComponent
type: Class
comment: AccountRelatedAccountComponent: Other associated accounts related to this account.
subclass of: BackboneElement
subclass of: Restriction
  cardinality: 1
  on property: account
subclass of: Restriction
  all values from: Reference
  on property: account
subclass of: Restriction
  max cardinality: 1
  on property: relationship
subclass of: Restriction
  all values from: CodeableConcept
  on property: relationship

_OperationOutcome
type: Class
comment: (Modified) OperationOutcome
subclass of: DomainResource

orientation
type: ObjectProperty
comment: SubstancePolymer.repeat.repeatUnit.orientation: The orientation of the polymerisation, e.g. head-tail, head-head, random.
comment: MolecularSequence.relative.startingSequence.orientation: A relative reference to a DNA strand based on gene orientation. The strand that contains the open reading frame of the gene is the "sense" strand, and the opposite complementary strand is the "antisense" strand.
modifierExtensionProperty: orientation
title: SubstancePolymer.repeat.repeatUnit.orientation: The orientation of the polymerisation, e.g. head-tail, head-head, random
title: MolecularSequence.relative.startingSequence.orientation: sense | antisense

holder
type: ObjectProperty
comment: RegulatedAuthorization.holder: The organization that has been granted this authorization, by some authoritative body (the 'regulator').
modifierExtensionProperty: _holder
title: RegulatedAuthorization.holder: The organization that has been granted this authorization, by the regulator

_mitigatingAction
type: ObjectProperty
comment: (Modified) AdverseEvent.mitigatingAction

include
type: ObjectProperty
comment: ValueSet.compose.include: Include one or more codes from a code system or other value set(s).
comment: SubscriptionTopic.notificationShape.include: Search-style _include directives, rooted in the resource for this shape. Servers SHOULD include resources listed here, if they exist and the user is authorized to receive them. Clients SHOULD be prepared to receive these additional resources, but SHALL function properly without them.
modifierExtensionProperty: include
title: ValueSet.compose.include: Include one or more codes from a code system or other value set(s)
title: SubscriptionTopic.notificationShape.include: Include directives, rooted in the resource for this shape

_conditionalPatch
type: ObjectProperty
comment: (Modified) CapabilityStatement.rest.resource.conditionalPatch

NamingSystemUniqueIdComponent
type: Class
comment: NamingSystemUniqueIdComponent: Indicates how the system may be identified when referenced in electronic exchange.
subclass of: BackboneElement
subclass of: Restriction
  max cardinality: 1
  on property: period
subclass of: Restriction
  all values from: string
  on property: comment
subclass of: Restriction
  all values from: string
  on property: value
subclass of: Restriction
  max cardinality: 1
  on property: authoritative
subclass of: Restriction
  all values from: Period
  on property: period
subclass of: Restriction
  all values from: boolean
  on property: authoritative
subclass of: Restriction
  cardinality: 1
  on property: type
subclass of: Restriction
  all values from: code
  on property: type
subclass of: Restriction
  max cardinality: 1
  on property: preferred
subclass of: Restriction
  max cardinality: 1
  on property: comment
subclass of: Restriction
  cardinality: 1
  on property: value
subclass of: Restriction
  all values from: boolean
  on property: preferred

_threshold
type: ObjectProperty
comment: (Modified) EvidenceVariable.characteristic.definitionByCombination.characteristic.definitionByCombination.threshold
comment: (Modified) EvidenceVariable.characteristic.definitionByCombination.threshold

Count
type: Class
comment: A measured amount (or an amount that can potentially be measured). Note that measured amounts include amounts that are not precisely quantified, including amounts involving arbitrary units and floating currencies.
subclass of: Quantity
title: A measured or measurable amount

_instantiates
type: ObjectProperty
comment: (Modified) Observation.instantiates
comment: (Modified) NutritionOrder.instantiates
comment: (Modified) CapabilityStatement.instantiates

media
type: ObjectProperty
comment: DiagnosticReport.media: A list of key images or data associated with this report. The images or data are generally created during the diagnostic process, and may be directly of the patient, or of treated specimens (i.e. slides of interest).
modifierExtensionProperty: media
title: DiagnosticReport.media: Key images or data associated with this report

appliesTo
type: ObjectProperty
comment: Observation.component.referenceRange.appliesTo: Codes to indicate the target population this reference range applies to. For example, a reference range may be based on the normal population or a particular sex or race. Multiple `appliesTo` are interpreted as an "AND" of the target populations. For example, to represent a target population of African American females, both a code of female and a code for African American would be used.
comment: Observation.referenceRange.appliesTo: Codes to indicate the target population this reference range applies to. For example, a reference range may be based on the normal population or a particular sex or race. Multiple `appliesTo` are interpreted as an "AND" of the target populations. For example, to represent a target population of African American females, both a code of female and a code for African American would be used.
comment: ObservationDefinition.component.qualifiedValue.appliesTo: The target population this set of qualified values applies to.
comment: ObservationDefinition.qualifiedValue.appliesTo: The target population this set of qualified values applies to.
modifierExtensionProperty: appliesTo
title: ObservationDefinition.qualifiedValue.appliesTo: Targetted population for the set of qualified values
title: Observation.referenceRange.appliesTo: Reference range population
title: Observation.component.referenceRange.appliesTo: Reference range population
title: ObservationDefinition.component.qualifiedValue.appliesTo: Targetted population for the set of qualified values

_implementationGuide
type: ObjectProperty
comment: (Modified) CapabilityStatement.implementationGuide

RequestOrchestrationActionInputComponent
type: Class
comment: RequestOrchestrationActionComponentAction.RequestOrchestrationActionInputComponent: Defines input data requirements for the action.
comment: RequestOrchestrationActionComponent.RequestOrchestrationActionInputComponent: Defines input data requirements for the action.
subclass of: BackboneElement
subclass of: Restriction
  max cardinality: 1
  on property: relatedData
subclass of: Restriction
  all values from: string
  on property: title
subclass of: Restriction
  all values from: id
  on property: relatedData
subclass of: Restriction
  max cardinality: 1
  on property: requirement
subclass of: Restriction
  max cardinality: 1
  on property: title
subclass of: Restriction
  max cardinality: 1
  on property: relatedData
subclass of: Restriction
  all values from: string
  on property: title
subclass of: Restriction
  all values from: DataRequirement
  on property: requirement
subclass of: Restriction
  all values from: id
  on property: relatedData
subclass of: Restriction
  max cardinality: 1
  on property: requirement
subclass of: Restriction
  max cardinality: 1
  on property: title
subclass of: Restriction
  all values from: DataRequirement
  on property: requirement

_discriminator
type: ObjectProperty
comment: (Modified) ElementDefinition.slicing.discriminator

ClaimResponse
type: Class
comment: This resource provides the adjudication details from the processing of a Claim resource.
subclass of: DomainResource
subclass of: financial.billing
subclass of: Restriction
  all values from: ClaimResponseAdjudication
  on property: adjudication
subclass of: Restriction
  all values from: ClaimResponseEventComponent
  on property: event
subclass of: Restriction
  max cardinality: 1
  on property: fundsReserve
subclass of: Restriction
  all values from: Identifier
  on property: traceNumber
subclass of: Restriction
  all values from: CodeableConcept
  on property: diagnosisRelatedGroup
subclass of: Restriction
  all values from: Identifier
  on property: identifier
subclass of: Restriction
  all values from: code
  on property: status
subclass of: Restriction
  cardinality: 1
  on property: status
subclass of: Restriction
  max cardinality: 1
  on property: diagnosisRelatedGroup
subclass of: Restriction
  all values from: Reference
  on property: encounter
subclass of: Restriction
  all values from: string
  on property: disposition
subclass of: Restriction
  max cardinality: 1
  on property: requestor
subclass of: Restriction
  all values from: Item
  on property: item
subclass of: Restriction
  all values from: CodeableConcept
  on property: decision
subclass of: Restriction
  all values from: Payment
  on property: payment
subclass of: Restriction
  all values from: code
  on property: use
subclass of: Restriction
  max cardinality: 1
  on property: subType
subclass of: Restriction
  cardinality: 1
  on property: outcome
subclass of: Restriction
  all values from: Reference
  on property: insurer
subclass of: Restriction
  cardinality: 1
  on property: use
subclass of: Restriction
  all values from: Reference
  on property: request
subclass of: Restriction
  cardinality: 1
  on property: patient
subclass of: Restriction
  all values from: string
  on property: preAuthRef
subclass of: Restriction
  all values from: code
  on property: outcome
subclass of: Restriction
  all values from: Error
  on property: error
subclass of: Restriction
  all values from: CodeableConcept
  on property: fundsReserve
subclass of: Restriction
  max cardinality: 1
  on property: disposition
subclass of: Restriction
  all values from: Insurance
  on property: insurance
subclass of: Restriction
  all values from: Total
  on property: total
subclass of: Restriction
  max cardinality: 1
  on property: decision
subclass of: Restriction
  max cardinality: 1
  on property: insurer
subclass of: Restriction
  max cardinality: 1
  on property: request
subclass of: Restriction
  max cardinality: 1
  on property: formCode
subclass of: Restriction
  max cardinality: 1
  on property: payment
subclass of: Restriction
  all values from: CodeableConcept
  on property: subType
subclass of: Restriction
  all values from: CodeableConcept
  on property: type
subclass of: Restriction
  all values from: Reference
  on property: requestor
subclass of: Restriction
  cardinality: 1
  on property: type
subclass of: Restriction
  all values from: dateTime
  on property: created
subclass of: Restriction
  all values from: Attachment
  on property: form
subclass of: Restriction
  max cardinality: 1
  on property: preAuthPeriod
subclass of: Restriction
  all values from: AddedItem
  on property: addItem
subclass of: Restriction
  all values from: CodeableConcept
  on property: payeeType
subclass of: Restriction
  all values from: Reference
  on property: patient
subclass of: Restriction
  max cardinality: 1
  on property: payeeType
subclass of: Restriction
  all values from: Reference
  on property: communicationRequest
subclass of: Restriction
  all values from: CodeableConcept
  on property: formCode
subclass of: Restriction
  cardinality: 1
  on property: created
subclass of: Restriction
  max cardinality: 1
  on property: form
subclass of: Restriction
  all values from: Note
  on property: processNote
subclass of: Restriction
  all values from: Period
  on property: preAuthPeriod
subclass of: Restriction
  max cardinality: 1
  on property: preAuthRef
modifierExtensionClass: ClaimResponse

section
type: ObjectProperty
comment: EvidenceReport.section.section.section: A nested sub-section within this section.
comment: Composition.section.section.section: A nested sub-section within this section.
comment: Composition.section.section: A nested sub-section within this section.
comment: EvidenceReport.section: The root of the sections that make up the composition.
comment: EvidenceReport.section.section: A nested sub-section within this section.
comment: Composition.section: The root of the sections that make up the composition.
modifierExtensionProperty: section
title: EvidenceReport.section.section: Nested Section
title: EvidenceReport.section: Composition is broken into sections
title: EvidenceReport.section.section.section: Nested Section
title: Composition.section.section.section: Nested Section
title: Composition.section: Composition is broken into sections
title: Composition.section.section: Nested Section

_workflowStatus
type: ObjectProperty
comment: (Modified) ArtifactAssessment.workflowStatus

_DeviceMetric
type: Class
comment: (Modified) DeviceMetric
subclass of: DomainResource

diseaseSymptomProcedure
type: ObjectProperty
comment: ClinicalUseDefinition.indication.diseaseSymptomProcedure: The situation that is being documented as an indicaton for this item.
comment: ClinicalUseDefinition.contraindication.diseaseSymptomProcedure: The situation that is being documented as contraindicating against this item.
modifierExtensionProperty: diseaseSymptomProcedure
title: ClinicalUseDefinition.indication.diseaseSymptomProcedure: The situation that is being documented as an indicaton for this item
title: ClinicalUseDefinition.contraindication.diseaseSymptomProcedure: The situation that is being documented as contraindicating against this item

_keyword
type: ObjectProperty
comment: (Modified) StructureDefinition.keyword
comment: (Modified) ResearchStudy.keyword

_forecastStatus
type: ObjectProperty
comment: (Modified) ImmunizationRecommendation.recommendation.forecastStatus

Bundle
type: Class
comment: A container for a collection of resources.
subclass of: infrastructure.structure
subclass of: Resource
subclass of: Restriction
  all values from: Signature
  on property: signature
subclass of: Restriction
  max cardinality: 1
  on property: identifier
subclass of: Restriction
  all values from: instant
  on property: timestamp
subclass of: Restriction
  all values from: code
  on property: type
subclass of: Restriction
  all values from: BundleLinkComponent
  on property: link
subclass of: Restriction
  all values from: Resource
  on property: issues
subclass of: Restriction
  cardinality: 1
  on property: type
subclass of: Restriction
  max cardinality: 1
  on property: signature
subclass of: Restriction
  max cardinality: 1
  on property: total
subclass of: Restriction
  max cardinality: 1
  on property: issues
subclass of: Restriction
  all values from: unsignedInt
  on property: total
subclass of: Restriction
  all values from: BundleEntryComponent
  on property: entry
subclass of: Restriction
  all values from: Identifier
  on property: identifier
subclass of: Restriction
  max cardinality: 1
  on property: timestamp

_excluded
type: ObjectProperty
comment: (Modified) ExplanationOfBenefit.benefitBalance.excluded
comment: (Modified) CoverageEligibilityResponse.insurance.item.excluded

_transform
type: ObjectProperty
comment: (Modified) StructureMap.group.rule.rule.target.transform
comment: (Modified) StructureMap.group.rule.target.transform
comment: (Modified) RequestOrchestration.action.action.transform
comment: (Modified) RequestOrchestration.action.transform
comment: (Modified) PlanDefinition.action.action.transform
comment: (Modified) PlanDefinition.action.transform
comment: (Modified) ActivityDefinition.transform

intent
type: ObjectProperty
comment: CarePlan.intent: Indicates the level of authority/intentionality associated with the care plan and where the care plan fits into the workflow chain.
comment: ActivityDefinition.intent: Indicates the level of authority/intentionality associated with the activity and where the request should fit into the workflow chain.
comment: Contract.term.action.intent: Reason or purpose for the action stipulated by this Contract Provision.
comment: Transport.intent: Indicates the "level" of actionability associated with the Transport, i.e. i+R[9]Cs this a proposed transport, a planned transport, an actionable transport, etc.
comment: MedicationRequest.intent: Whether the request is a proposal, plan, or an original order.
comment: CommunicationRequest.intent: Indicates the level of authority/intentionality associated with the CommunicationRequest and where the request fits into the workflow chain.
comment: Contract.term.group.action.intent: Reason or purpose for the action stipulated by this Contract Provision.
comment: RequestOrchestration.intent: Indicates the level of authority/intentionality associated with the request and where the request fits into the workflow chain.
comment: DeviceRequest.intent: Whether the request is a proposal, plan, an original order or a reflex order.
comment: ServiceRequest.intent: Whether the request is a proposal, plan, an original order or a reflex order.
comment: NutritionOrder.intent: Indicates the level of authority/intentionality associated with the NutrionOrder and where the request fits into the workflow chain.
comment: Task.intent: Indicates the "level" of actionability associated with the Task, i.e. i+R[9]Cs this a proposed task, a planned task, an actionable task, etc.
sub property of: class
sub property of: why
modifierExtensionProperty: _intent
title: Task.intent: unknown | proposal | plan | order | original-order | reflex-order | filler-order | instance-order | option
title: MedicationRequest.intent: proposal | plan | order | original-order | reflex-order | filler-order | instance-order | option
title: Contract.term.action.intent: Purpose for the Contract Term Action
title: CarePlan.intent: proposal | plan | order | option | directive
title: NutritionOrder.intent: proposal | plan | directive | order | original-order | reflex-order | filler-order | instance-order | option
title: RequestOrchestration.intent: proposal | plan | directive | order | original-order | reflex-order | filler-order | instance-order | option
title: CommunicationRequest.intent: proposal | plan | directive | order | original-order | reflex-order | filler-order | instance-order | option
title: ServiceRequest.intent: proposal | plan | directive | order +
title: DeviceRequest.intent: proposal | plan | directive | order | original-order | reflex-order | filler-order | instance-order | option
title: Contract.term.group.action.intent: Purpose for the Contract Term Action
title: ActivityDefinition.intent: proposal | plan | directive | order | original-order | reflex-order | filler-order | instance-order | option
title: Transport.intent: unknown | proposal | plan | order | original-order | reflex-order | filler-order | instance-order | option

_slicing
type: ObjectProperty
comment: (Modified) ElementDefinition.slicing

generalPractitioner
type: ObjectProperty
comment: Patient.generalPractitioner: Patient's nominated care provider.
modifierExtensionProperty: _generalPractitioner
title: Patient.generalPractitioner: Patient's nominated primary care provider

gestationalAge
type: ObjectProperty
comment: ObservationDefinition.component.qualifiedValue.gestationalAge: The gestational age this set of qualified values applies to.
comment: ObservationDefinition.qualifiedValue.gestationalAge: The gestational age this set of qualified values applies to.
modifierExtensionProperty: _gestationalAge
title: ObservationDefinition.component.qualifiedValue.gestationalAge: Applicable gestational age range for the set of qualified values
title: ObservationDefinition.qualifiedValue.gestationalAge: Applicable gestational age range for the set of qualified values

_account
type: ObjectProperty
comment: (Modified) PaymentReconciliation.allocation.account
comment: (Modified) Invoice.account
comment: (Modified) EpisodeOfCare.account
comment: (Modified) Encounter.account
comment: (Modified) ChargeItem.account
comment: (Modified) Appointment.account
comment: (Modified) Account.relatedAccount.account

_administeredProduct
type: ObjectProperty
comment: (Modified) Immunization.administeredProduct

answerOption
type: ObjectProperty
comment: Questionnaire.item.item.answerOption: One of the permitted answers for the question.
comment: Questionnaire.item.answerOption: One of the permitted answers for the question.
modifierExtensionProperty: _answerOption
title: Questionnaire.item.item.answerOption: Permitted answer
title: Questionnaire.item.answerOption: Permitted answer

regionType
type: ObjectProperty
comment: ImagingSelection.instance.imageRegion3D.regionType: Specifies the type of image region.
comment: ImagingSelection.instance.imageRegion2D.regionType: Specifies the type of image region.
modifierExtensionProperty: _regionType
title: ImagingSelection.instance.imageRegion3D.regionType: point | multipoint | polyline | polygon | ellipse | ellipsoid
title: ImagingSelection.instance.imageRegion2D.regionType: point | polyline | interpolated | circle | ellipse

_association
type: ObjectProperty
comment: (Modified) InventoryItem.association

_messaging
type: ObjectProperty
comment: (Modified) CapabilityStatement.messaging

organismType
type: ObjectProperty
comment: SubstanceReferenceInformation.target.organismType: Todo.
modifierExtensionProperty: organismType
title: SubstanceReferenceInformation.target.organismType: Todo

accept
type: ObjectProperty
comment: TestScript.teardown.action.operation.accept: The mime-type to use for RESTful operation in the 'Accept' header.
comment: TestScript.test.action.operation.accept: The mime-type to use for RESTful operation in the 'Accept' header.
comment: TestScript.setup.action.operation.accept: The mime-type to use for RESTful operation in the 'Accept' header.
modifierExtensionProperty: _accept
title: TestScript.teardown.action.operation.accept: Mime type to accept in the payload of the response, with charset etc
title: TestScript.test.action.operation.accept: Mime type to accept in the payload of the response, with charset etc
title: TestScript.setup.action.operation.accept: Mime type to accept in the payload of the response, with charset etc

_methodType
type: ObjectProperty
comment: (Modified) GenomicStudy.analysis.methodType

_authorizationRequired
type: ObjectProperty
comment: (Modified) CoverageEligibilityResponse.insurance.item.authorizationRequired

includedStructure
type: ObjectProperty
comment: BodyStructure.includedStructure: The anatomical location(s) or region(s) of the specimen, lesion, or body structure.
modifierExtensionProperty: includedStructure
title: BodyStructure.includedStructure: Included anatomic location(s)

sourceIdentityCertificate
type: ObjectProperty
comment: VerificationResult.attestation.sourceIdentityCertificate: A digital identity certificate associated with the attestation source.
modifierExtensionProperty: sourceIdentityCertificate
title: VerificationResult.attestation.sourceIdentityCertificate: A digital identity certificate associated with the attestation source

foodType
type: ObjectProperty
comment: NutritionOrder.oralDiet.texture.foodType: The food type(s) (e.g. meats, all foods) that the texture modification applies to. This could be all foods types.
modifierExtensionProperty: foodType
title: NutritionOrder.oralDiet.texture.foodType: Concepts that are used to identify an entity that is ingested for nutritional purposes

temperatureRange
type: ObjectProperty
comment: SpecimenDefinition.typeTested.handling.temperatureRange: The temperature interval for this set of handling instructions.
modifierExtensionProperty: temperatureRange
title: SpecimenDefinition.typeTested.handling.temperatureRange: Temperature range for these handling instructions

ManifestPage
type: Class
comment: ImplementationGuideManifestComponent.ManifestPage: Information about a page within the IG.
subclass of: BackboneElement
subclass of: Restriction
  all values from: string
  on property: anchor
subclass of: Restriction
  max cardinality: 1
  on property: title
subclass of: Restriction
  all values from: string
  on property: title
subclass of: Restriction
  cardinality: 1
  on property: name
subclass of: Restriction
  all values from: string
  on property: name

DeviceRequest
type: Class
comment: Represents a request a device to be provided to a specific patient. The device may be an implantable device to be subsequently implanted, or an external assistive device, such as a walker, to be delivered and subsequently be used.
subclass of: workflow.order
subclass of: DomainResource
subclass of: Restriction
  all values from: Reference
  on property: basedOn
subclass of: Restriction
  all values from: Reference
  on property: subject
subclass of: Restriction
  max cardinality: 1
  on property: asNeededFor
subclass of: Restriction
  cardinality: 1
  on property: code
subclass of: Restriction
  max cardinality: 1
  on property: authoredOn
subclass of: Restriction
  all values from: CodeableReference
  on property: performer
subclass of: Restriction
  all values from: boolean
  on property: doNotPerform
subclass of: Restriction
  all values from: integer
  on property: quantity
subclass of: Restriction
  max cardinality: 1
  on property: performer
subclass of: Restriction
  all values from: Reference
  on property: supportingInfo
subclass of: Restriction
  all values from: Reference
  on property: encounter
subclass of: Restriction
  max cardinality: 1
  on property: asNeeded
subclass of: Restriction
  max cardinality: 1
  on property: status
subclass of: Restriction
  all values from: Annotation
  on property: note
subclass of: Restriction
  all values from: code
  on property: status
subclass of: Restriction
  all values from: boolean
  on property: asNeeded
subclass of: Restriction
  max cardinality: 1
  on property: encounter
subclass of: Restriction
  max cardinality: 1
  on property: priority
subclass of: Restriction
  all values from: Reference
  on property: relevantHistory
subclass of: Restriction
  max cardinality: 1
  on property: requester
subclass of: Restriction
  all values from: Identifier
  on property: groupIdentifier
subclass of: Restriction
  max cardinality: 1
  on property: groupIdentifier
subclass of: Restriction
  all values from: CodeableReference
  on property: code
subclass of: Restriction
  all values from: Reference
  on property: insurance
subclass of: Restriction
  all values from: uri
  on property: instantiatesUri
subclass of: Restriction
  all values from: Reference
  on property: requester
subclass of: Restriction
  all values from: DeviceRequestParameterComponent
  on property: parameter
subclass of: Restriction
  all values from: CodeableReference
  on property: reason
subclass of: Restriction
  cardinality: 1
  on property: subject
subclass of: Restriction
  all values from: canonical
  on property: instantiatesCanonical
subclass of: Restriction
  all values from: CodeableConcept
  on property: asNeededFor
subclass of: Restriction
  all values from: dateTime
  on property: authoredOn
subclass of: Restriction
  all values from: Reference
  on property: replaces
subclass of: Restriction
  all values from: code
  on property: intent
subclass of: Restriction
  cardinality: 1
  on property: intent
subclass of: Restriction
  max cardinality: 1
  on property: doNotPerform
subclass of:
  union of: Restriction
    all values from: dateTime
    on property: occurrence
  union of: Restriction
    max cardinality: 1
    on property: occurrence
  union of: Restriction
    all values from: Period
    on property: occurrence
  union of: Restriction
    max cardinality: 1
    on property: occurrence
  union of: Restriction
    all values from: Timing
    on property: occurrence
  union of: Restriction
    max cardinality: 1
    on property: occurrence
subclass of: Restriction
  max cardinality: 1
  on property: quantity
subclass of: Restriction
  all values from: code
  on property: priority
subclass of: Restriction
  all values from: Identifier
  on property: identifier
modifierExtensionClass: DeviceRequest

_contextLinkId
type: ObjectProperty
comment: (Modified) Contract.term.group.action.contextLinkId
comment: (Modified) Contract.term.action.contextLinkId

ExampleScenarioProcessStepOperationComponent
type: Class
comment: ExampleScenarioProcessComponent.ExampleScenarioProcessStepComponent.ExampleScenarioProcessStepOperationComponent: The step represents a single operation invoked on receiver by sender.
comment: ExampleScenarioProcessComponent.ExampleScenarioProcessStepComponentProcess.ExampleScenarioProcessStepComponent.ExampleScenarioProcessStepOperationComponent: The step represents a single operation invoked on receiver by sender.
comment: ExampleScenarioProcessComponent.ExampleScenarioProcessStepComponentProcess.ExampleScenarioProcessStepComponent.ExampleScenarioProcessStepAlternativeComponentStep.ExampleScenarioProcessStepOperationComponent: The step represents a single operation invoked on receiver by sender.
comment: ExampleScenarioProcessComponent.ExampleScenarioProcessStepComponent.ExampleScenarioProcessStepAlternativeComponentStep.ExampleScenarioProcessStepOperationComponent: The step represents a single operation invoked on receiver by sender.
comment: ExampleScenarioProcessComponent.ExampleScenarioProcessStepComponent.ExampleScenarioProcessStepAlternativeComponentStepProcess.ExampleScenarioProcessStepComponent.ExampleScenarioProcessStepOperationComponent: The step represents a single operation invoked on receiver by sender.
subclass of: BackboneElement
subclass of: Restriction
  all values from: string
  on property: title
subclass of: Restriction
  all values from: ExampleScenarioProcessComponent.ExampleScenarioProcessStepComponentProcess.ExampleScenarioProcessStepComponent.ExampleScenarioProcessStepAlternativeComponentStep.ExampleScenarioProcessStepOperationComponentContainedInstance
  on property: response
subclass of: Restriction
  max cardinality: 1
  on property: initiatorActive
subclass of: Restriction
  max cardinality: 1
  on property: description
subclass of: Restriction
  max cardinality: 1
  on property: initiatorActive
subclass of: Restriction
  all values from: string
  on property: title
subclass of: Restriction
  max cardinality: 1
  on property: request
subclass of: Restriction
  all values from: markdown
  on property: description
subclass of: Restriction
  all values from: Coding
  on property: type
subclass of: Restriction
  max cardinality: 1
  on property: description
subclass of: Restriction
  max cardinality: 1
  on property: description
subclass of: Restriction
  max cardinality: 1
  on property: type
subclass of: Restriction
  all values from: Instance transmitted on invocation
  on property: request
subclass of: Restriction
  max cardinality: 1
  on property: receiverActive
subclass of: Restriction
  all values from: string
  on property: initiator
subclass of: Restriction
  max cardinality: 1
  on property: receiver
subclass of: Restriction
  max cardinality: 1
  on property: type
subclass of: Restriction
  max cardinality: 1
  on property: type
subclass of: Restriction
  max cardinality: 1
  on property: description
subclass of: Restriction
  max cardinality: 1
  on property: request
subclass of: Restriction
  all values from: Coding
  on property: type
subclass of: Restriction
  max cardinality: 1
  on property: initiator
subclass of: Restriction
  max cardinality: 1
  on property: response
subclass of: Restriction
  all values from: ExampleScenarioProcessComponent.ExampleScenarioProcessStepComponent.ExampleScenarioProcessStepOperationComponentContainedInstance
  on property: response
subclass of: Restriction
  all values from: markdown
  on property: description
subclass of: Restriction
  all values from: boolean
  on property: initiatorActive
subclass of: Restriction
  max cardinality: 1
  on property: receiverActive
subclass of: Restriction
  max cardinality: 1
  on property: request
subclass of: Restriction
  all values from: ExampleScenarioProcessComponent.ExampleScenarioProcessStepComponentProcess.ExampleScenarioProcessStepComponent.ExampleScenarioProcessStepOperationComponentContainedInstance
  on property: response
subclass of: Restriction
  max cardinality: 1
  on property: response
subclass of: Restriction
  all values from: string
  on property: initiator
subclass of: Restriction
  max cardinality: 1
  on property: initiatorActive
subclass of: Restriction
  all values from: ExampleScenarioProcessComponent.ExampleScenarioProcessStepComponentProcess.ExampleScenarioProcessStepComponent.ExampleScenarioProcessStepOperationComponentContainedInstance
  on property: request
subclass of: Restriction
  max cardinality: 1
  on property: receiver
subclass of: Restriction
  all values from: markdown
  on property: description
subclass of: Restriction
  all values from: string
  on property: title
subclass of: Restriction
  all values from: string
  on property: receiver
subclass of: Restriction
  all values from: Coding
  on property: type
subclass of: Restriction
  cardinality: 1
  on property: title
subclass of: Restriction
  max cardinality: 1
  on property: request
subclass of: Restriction
  cardinality: 1
  on property: title
subclass of: Restriction
  cardinality: 1
  on property: title
subclass of: Restriction
  max cardinality: 1
  on property: response
subclass of: Restriction
  max cardinality: 1
  on property: initiatorActive
subclass of: Restriction
  all values from: boolean
  on property: receiverActive
subclass of: Restriction
  all values from: ExampleScenarioProcessComponent.ExampleScenarioProcessStepComponent.ExampleScenarioProcessStepAlternativeComponentStep.ExampleScenarioProcessStepOperationComponentContainedInstance
  on property: response
subclass of: Restriction
  max cardinality: 1
  on property: response
subclass of: Restriction
  max cardinality: 1
  on property: response
subclass of: Restriction
  all values from: string
  on property: receiver
subclass of: Restriction
  all values from: Coding
  on property: type
subclass of: Restriction
  all values from: ExampleScenarioProcessComponent.ExampleScenarioProcessStepComponentProcess.ExampleScenarioProcessStepComponent.ExampleScenarioProcessStepAlternativeComponentStep.ExampleScenarioProcessStepOperationComponentContainedInstance
  on property: request
subclass of: Restriction
  all values from: boolean
  on property: initiatorActive
subclass of: Restriction
  max cardinality: 1
  on property: initiator
subclass of: Restriction
  max cardinality: 1
  on property: receiver
subclass of: Restriction
  all values from: ExampleScenarioProcessComponent.ExampleScenarioProcessStepComponent.ExampleScenarioProcessStepOperationComponentContainedInstance
  on property: request
subclass of: Restriction
  all values from: string
  on property: receiver
subclass of: Restriction
  all values from: markdown
  on property: description
subclass of: Restriction
  all values from: boolean
  on property: receiverActive
subclass of: Restriction
  all values from: string
  on property: receiver
subclass of: Restriction
  all values from: string
  on property: title
subclass of: Restriction
  all values from: boolean
  on property: initiatorActive
subclass of: Restriction
  all values from: boolean
  on property: initiatorActive
subclass of: Restriction
  all values from: string
  on property: initiator
subclass of: Restriction
  max cardinality: 1
  on property: receiverActive
subclass of: Restriction
  all values from: string
  on property: receiver

SubstanceDefinitionStructureComponent
type: Class
comment: SubstanceDefinitionStructureComponent: Structural information.
subclass of: BackboneElement
subclass of: Restriction
  max cardinality: 1
  on property: stereochemistry
subclass of: Restriction
  max cardinality: 1
  on property: molecularWeight
subclass of: Restriction
  max cardinality: 1
  on property: molecularFormula
subclass of: Restriction
  all values from: SubstanceDefinitionStructureRepresentationComponent
  on property: representation
subclass of: Restriction
  all values from: CodeableConcept
  on property: opticalActivity
subclass of: Restriction
  all values from: CodeableConcept
  on property: stereochemistry
subclass of: Restriction
  all values from: string
  on property: molecularFormula
subclass of: Restriction
  all values from: CodeableConcept
  on property: technique
subclass of: Restriction
  all values from: SubstanceDefinitionStructureComponentMolecularWeight
  on property: molecularWeight
subclass of: Restriction
  all values from: Reference
  on property: sourceDocument
subclass of: Restriction
  max cardinality: 1
  on property: molecularFormulaByMoiety
subclass of: Restriction
  max cardinality: 1
  on property: opticalActivity
subclass of: Restriction
  all values from: string
  on property: molecularFormulaByMoiety

calculatedAt
type: ObjectProperty
comment: Account.calculatedAt: Time the balance amount was calculated.
modifierExtensionProperty: calculatedAt
title: Account.calculatedAt: Time the balance amount was calculated

MarketingStatus
type: Class
comment: The marketing status describes the date when a medicinal product is actually put on the market or the date as of which it is no longer available.
subclass of: BackboneType
subclass of: Restriction
  all values from: dateTime
  on property: restoreDate
subclass of: Restriction
  all values from: CodeableConcept
  on property: country
subclass of: Restriction
  all values from: Period
  on property: dateRange
subclass of: Restriction
  max cardinality: 1
  on property: dateRange
subclass of: Restriction
  all values from: CodeableConcept
  on property: status
subclass of: Restriction
  cardinality: 1
  on property: status
subclass of: Restriction
  all values from: CodeableConcept
  on property: jurisdiction
subclass of: Restriction
  max cardinality: 1
  on property: country
subclass of: Restriction
  max cardinality: 1
  on property: jurisdiction
subclass of: Restriction
  max cardinality: 1
  on property: restoreDate
modifierExtensionClass: MarketingStatus
title: The marketing status describes the date when a medicinal product is actually put on the market or the date as of which it is no longer available

_emptyReason
type: ObjectProperty
comment: (Modified) List.emptyReason
comment: (Modified) EvidenceReport.section.section.emptyReason
comment: (Modified) EvidenceReport.section.emptyReason
comment: (Modified) Composition.section.section.emptyReason
comment: (Modified) Composition.section.emptyReason

_offsets
type: ObjectProperty
comment: (Modified) SampledData.offsets

_financial
type: ObjectProperty
comment: (Modified) ExplanationOfBenefit.benefitBalance.financial

_exposureRoute
type: ObjectProperty
comment: (Modified) AllergyIntolerance.reaction.exposureRoute

_policyHolder
type: ObjectProperty
comment: (Modified) Coverage.policyHolder

SupplyDeliverySuppliedItemComponent
type: Class
comment: SupplyDeliverySuppliedItemComponent: The item that is being delivered or has been supplied.
subclass of: BackboneElement
subclass of:
  union of: Restriction
    all values from: CodeableConcept
    on property: item
  union of: Restriction
    max cardinality: 1
    on property: item
  union of: Restriction
    all values from: Reference
    on property: item
  union of: Restriction
    max cardinality: 1
    on property: item
subclass of: Restriction
  max cardinality: 1
  on property: quantity
subclass of: Restriction
  all values from: SimpleQuantity
  on property: quantity

intendedRoute
type: ObjectProperty
comment: MedicationKnowledge.definitional.intendedRoute: The intended or approved route of administration.
modifierExtensionProperty: intendedRoute
title: MedicationKnowledge.definitional.intendedRoute: The intended or approved route of administration

_paymentDate
type: ObjectProperty
comment: (Modified) PaymentNotice.paymentDate
comment: (Modified) Contract.term.group.asset.valuedItem.paymentDate
comment: (Modified) Contract.term.asset.valuedItem.paymentDate

GenomicStudyAnalysisDeviceComponent
type: Class
comment: GenomicStudyAnalysisComponent.GenomicStudyAnalysisDeviceComponent: Devices used for the analysis (e.g., instruments, software), with settings and parameters.
subclass of: BackboneElement
subclass of: Restriction
  max cardinality: 1
  on property: function
subclass of: Restriction
  all values from: CodeableConcept
  on property: function
subclass of: Restriction
  max cardinality: 1
  on property: device
subclass of: Restriction
  all values from: Reference
  on property: device

_informationProvider
type: ObjectProperty
comment: (Modified) CommunicationRequest.informationProvider

_outsideFoodAllowed
type: ObjectProperty
comment: (Modified) NutritionOrder.outsideFoodAllowed

feature
type: ObjectProperty
comment: Specimen.feature: A physical feature or landmark on a specimen, highlighted for context by the collector of the specimen (e.g. surgeon), that identifies the type of feature as well as its meaning (e.g. the red ink indicating the resection margin of the right lobe of the excised prostate tissue or wire loop at radiologically suspected tumor location).
modifierExtensionProperty: feature
title: Specimen.feature: The physical feature of a specimen

needsMap
type: ObjectProperty
comment: TerminologyCapabilities.translation.needsMap: Whether the client must identify the map.
modifierExtensionProperty: needsMap
title: TerminologyCapabilities.translation.needsMap: Whether the client must identify the map

_dataAbsentReason
type: ObjectProperty
comment: (Modified) Observation.component.dataAbsentReason
comment: (Modified) Observation.dataAbsentReason
comment: (Modified) FamilyMemberHistory.dataAbsentReason

_definition
type: ObjectProperty
comment: (Modified) CapabilityStatement.messaging.supportedMessage.definition
comment: (Modified) ElementDefinition.definition
comment: (Modified) CodeSystem.concept.definition
comment: (Modified) PlanDefinition.action.definition
comment: (Modified) QuestionnaireResponse.item.definition
comment: (Modified) MessageHeader.definition
comment: (Modified) CodeSystem.concept.concept.definition
comment: (Modified) Questionnaire.item.item.definition
comment: (Modified) CapabilityStatement.rest.operation.definition
comment: (Modified) RequestOrchestration.action.definition
comment: (Modified) Questionnaire.item.definition
comment: (Modified) RequestOrchestration.action.action.definition
comment: (Modified) Medication.definition
comment: (Modified) CapabilityStatement.rest.searchParam.definition
comment: (Modified) CapabilityStatement.rest.resource.searchParam.definition
comment: (Modified) CapabilityStatement.rest.resource.operation.definition
comment: (Modified) SearchParameter.component.definition
comment: (Modified) ImplementationGuide.definition
comment: (Modified) Device.definition
comment: (Modified) QuestionnaireResponse.item.answer.item.definition
comment: (Modified) ConditionDefinition.definition
comment: (Modified) PlanDefinition.action.action.definition
comment: (Modified) MedicationKnowledge.definitional.definition
comment: (Modified) QuestionnaireResponse.item.item.definition
comment: (Modified) Measure.term.definition

creation
type: ObjectProperty
comment: Invoice.creation: Date/time(s) of when this Invoice was posted.
comment: Attachment.creation: The date that the attachment was first created.
modifierExtensionProperty: creation
title: Invoice.creation: When posted
title: Attachment.creation: Date attachment was first created

_minValue
type: ObjectProperty
comment: (Modified) ElementDefinition.minValue

width
type: ObjectProperty
comment: Attachment.width: Width of the image in pixels (photo/video).
modifierExtensionProperty: width
title: Attachment.width: Width of the image in pixels (photo/video)

_Permission
type: Class
comment: (Modified) Permission
subclass of: DomainResource

AllergyIntolerance
type: Class
comment: Risk of harmful or undesirable, physiological response which is unique to an individual and associated with exposure to a substance.
subclass of: clinical.general
subclass of: DomainResource
subclass of: Restriction
  all values from: CodeableConcept
  on property: verificationStatus
subclass of: Restriction
  all values from: CodeableConcept
  on property: clinicalStatus
subclass of: Restriction
  max cardinality: 1
  on property: clinicalStatus
subclass of: Restriction
  max cardinality: 1
  on property: recordedDate
subclass of: Restriction
  all values from: Identifier
  on property: identifier
subclass of: Restriction
  cardinality: 1
  on property: patient
subclass of: Restriction
  max cardinality: 1
  on property: criticality
subclass of: Restriction
  all values from: CodeableConcept
  on property: type
subclass of: Restriction
  all values from: code
  on property: category
subclass of: Restriction
  all values from: AllergyIntoleranceParticipantComponent
  on property: participant
subclass of: Restriction
  all values from: dateTime
  on property: recordedDate
subclass of: Restriction
  max cardinality: 1
  on property: encounter
subclass of: Restriction
  all values from: Annotation
  on property: note
subclass of: Restriction
  all values from: CodeableConcept
  on property: code
subclass of: Restriction
  all values from: Reference
  on property: patient
subclass of: Restriction
  all values from: Reference
  on property: encounter
subclass of: Restriction
  all values from: AllergyIntoleranceReactionComponent
  on property: reaction
subclass of:
  union of: Restriction
    all values from: dateTime
    on property: onset
  union of: Restriction
    max cardinality: 1
    on property: onset
  union of: Restriction
    all values from: Age
    on property: onset
  union of: Restriction
    max cardinality: 1
    on property: onset
  union of: Restriction
    all values from: Period
    on property: onset
  union of: Restriction
    max cardinality: 1
    on property: onset
  union of: Restriction
    all values from: Range
    on property: onset
  union of: Restriction
    max cardinality: 1
    on property: onset
  union of: Restriction
    all values from: string
    on property: onset
  union of: Restriction
    max cardinality: 1
    on property: onset
subclass of: Restriction
  all values from: code
  on property: criticality
subclass of: Restriction
  max cardinality: 1
  on property: code
subclass of: Restriction
  max cardinality: 1
  on property: type
subclass of: Restriction
  max cardinality: 1
  on property: lastOccurrence
subclass of: Restriction
  all values from: dateTime
  on property: lastOccurrence
subclass of: Restriction
  max cardinality: 1
  on property: verificationStatus
modifierExtensionClass: AllergyIntolerance

_Encounter
type: Class
comment: (Modified) Encounter
subclass of: DomainResource

targetNumber
type: ObjectProperty
comment: ResearchStudy.recruitment.targetNumber: Estimated total number of participants to be enrolled.
modifierExtensionProperty: _targetNumber
title: ResearchStudy.recruitment.targetNumber: Estimated total number of participants to be enrolled

severity
type: ObjectProperty
comment: AllergyIntolerance.reaction.severity: Clinical assessment of the severity of the reaction event as a whole, potentially considering multiple different manifestations.
comment: ElementDefinition.constraint.severity: Identifies the impact constraint violation has on the conformance of the instance.
comment: DetectedIssue.severity: Indicates the degree of importance associated with the identified issue based on the potential impact on the patient.
comment: Condition.severity: A subjective assessment of the severity of the condition as evaluated by the clinician.
comment: AuditEvent.severity: Indicates and enables segmentation of various severity including debugging from critical.
comment: OperationOutcome.issue.severity: Indicates whether the issue indicates a variation from successful processing.
comment: ConditionDefinition.severity: A subjective assessment of the severity of the condition as evaluated by the clinician.
sub property of: grade
modifierExtensionProperty: severity
title: DetectedIssue.severity: high | moderate | low
title: AuditEvent.severity: emergency | alert | critical | error | warning | notice | informational | debug
title: OperationOutcome.issue.severity: fatal | error | warning | information | success
title: ElementDefinition.constraint.severity: error | warning
title: AllergyIntolerance.reaction.severity: mild | moderate | severe (of event as a whole)
title: Condition.severity: Subjective severity of condition
title: ConditionDefinition.severity: Subjective severity of condition

ObservationDefinitionQualifiedValueComponent
type: Class
comment: ObservationDefinitionQualifiedValueComponent: A set of qualified values associated with a context and a set of conditions - provides a range for quantitative and ordinal observations and a collection of value sets for qualitative observations.
subclass of: BackboneElement
subclass of: Restriction
  max cardinality: 1
  on property: gestationalAge
subclass of: Restriction
  all values from: Range
  on property: gestationalAge
subclass of: Restriction
  all values from: code
  on property: rangeCategory
subclass of: Restriction
  max cardinality: 1
  on property: age
subclass of: Restriction
  max cardinality: 1
  on property: criticalCodedValueSet
subclass of: Restriction
  max cardinality: 1
  on property: range
subclass of: Restriction
  all values from: code
  on property: gender
subclass of: Restriction
  all values from: CodeableConcept
  on property: context
subclass of: Restriction
  all values from: Range
  on property: age
subclass of: Restriction
  max cardinality: 1
  on property: abnormalCodedValueSet
subclass of: Restriction
  all values from: canonical
  on property: criticalCodedValueSet
subclass of: Restriction
  max cardinality: 1
  on property: context
subclass of: Restriction
  all values from: canonical
  on property: abnormalCodedValueSet
subclass of: Restriction
  max cardinality: 1
  on property: rangeCategory
subclass of: Restriction
  max cardinality: 1
  on property: condition
subclass of: Restriction
  max cardinality: 1
  on property: normalCodedValueSet
subclass of: Restriction
  all values from: canonical
  on property: normalCodedValueSet
subclass of: Restriction
  max cardinality: 1
  on property: gender
subclass of: Restriction
  all values from: canonical
  on property: validCodedValueSet
subclass of: Restriction
  all values from: Range
  on property: range
subclass of: Restriction
  all values from: CodeableConcept
  on property: appliesTo
subclass of: Restriction
  max cardinality: 1
  on property: validCodedValueSet
subclass of: Restriction
  all values from: string
  on property: condition

filterBy
type: ObjectProperty
comment: Subscription.filterBy: The filter properties to be applied to narrow the subscription topic stream. When multiple filters are applied, evaluates to true if all the conditions applicable to that resource are met; otherwise it returns false (i.e., logical AND).
modifierExtensionProperty: filterBy
title: Subscription.filterBy: Criteria for narrowing the subscription topic stream

packaging
type: ObjectProperty
comment: PackagedProductDefinition.packaging.packaging: Allows containers (and parts of containers) within containers, still as a part of a single packaged product. See also PackagedProductDefinition.packaging.containedItem.item(PackagedProductDefinition).
comment: DeviceDefinition.packaging: Information about the packaging of the device, i.e. how the device is packaged.
comment: MedicationKnowledge.packaging: Information that only applies to packages (not products).
comment: DeviceDefinition.packaging.packaging: Allows packages within packages.
comment: PackagedProductDefinition.packaging.packaging.packaging: Allows containers (and parts of containers) within containers, still as a part of a single packaged product. See also PackagedProductDefinition.packaging.containedItem.item(PackagedProductDefinition).
comment: PackagedProductDefinition.packaging: A packaging item, as a container for medically related items, possibly with other packaging items within, or a packaging component, such as bottle cap (which is not a device or a medication manufactured item).
comment: DeviceDefinition.packaging.packaging.packaging: Allows packages within packages.
modifierExtensionProperty: packaging
title: PackagedProductDefinition.packaging: A packaging item, as a container for medically related items, possibly with other packaging items within, or a packaging component, such as bottle cap
title: MedicationKnowledge.packaging: Details about packaged medications
title: DeviceDefinition.packaging.packaging.packaging: Allows packages within packages
title: DeviceDefinition.packaging.packaging: Allows packages within packages
title: PackagedProductDefinition.packaging.packaging.packaging: Allows containers (and parts of containers) within containers, still as a part of single packaged product
title: PackagedProductDefinition.packaging.packaging: Allows containers (and parts of containers) within containers, still as a part of single packaged product
title: DeviceDefinition.packaging: Information about the packaging of the device, i.e. how the device is packaged

endorser
type: ObjectProperty
comment: Citation.endorser: Who endorsed the citation record.
comment: MetadataResource.endorser: An individual or organization asserted by the publisher to be responsible for officially endorsing the {{title}} for use in some setting.
comment: ConceptMap.endorser: An individual or organization asserted by the publisher to be responsible for officially endorsing the ConceptMap for use in some setting.
comment: Library.endorser: An individual or organization asserted by the publisher to be responsible for officially endorsing the content for use in some setting.
comment: ValueSet.endorser: An individual or organization asserted by the publisher to be responsible for officially endorsing the ValueSet for use in some setting.
comment: EvidenceVariable.endorser: An individual or organization asserted by the publisher to be responsible for officially endorsing the content for use in some setting.
comment: ActivityDefinition.endorser: An individual or organization asserted by the publisher to be responsible for officially endorsing the content for use in some setting.
comment: Measure.endorser: An individual or organization asserted by the publisher to be responsible for officially endorsing the content for use in some setting.
comment: CodeSystem.endorser: An individual or organization asserted by the publisher to be responsible for officially endorsing the CodeSystem for use in some setting.
comment: Evidence.endorser: An individiual, organization, or device responsible for officially endorsing the content for use in some setting.
comment: PlanDefinition.endorser: An individual or organization asserted by the publisher to be responsible for officially endorsing the content for use in some setting.
comment: EvidenceReport.endorser: An individiual, organization, or device responsible for officially endorsing the content for use in some setting.
comment: NamingSystem.endorser: An individual or organization asserted by the publisher to be responsible for officially endorsing the NamingSystem for use in some setting.
comment: EventDefinition.endorser: An individual or organization asserted by the publisher to be responsible for officially endorsing the content for use in some setting.
modifierExtensionProperty: endorser
title: EventDefinition.endorser: Who endorsed the content
title: MetadataResource.endorser: Who endorsed the {{title}}
title: NamingSystem.endorser: Who endorsed the NamingSystem
title: EvidenceVariable.endorser: Who endorsed the content
title: Citation.endorser: Who endorsed the citation record
title: ConceptMap.endorser: Who endorsed the ConceptMap
title: Library.endorser: Who endorsed the content
title: ValueSet.endorser: Who endorsed the ValueSet
title: Evidence.endorser: Who endorsed the content
title: CodeSystem.endorser: Who endorsed the CodeSystem
title: EvidenceReport.endorser: Who endorsed the content
title: PlanDefinition.endorser: Who endorsed the content
title: ActivityDefinition.endorser: Who endorsed the content
title: Measure.endorser: Who endorsed the content

_relatesTo
type: ObjectProperty
comment: (Modified) EvidenceReport.relatesTo
comment: (Modified) DocumentReference.relatesTo
comment: (Modified) Composition.relatesTo
comment: (Modified) Citation.citedArtifact.relatesTo

_sourceSignature
type: ObjectProperty
comment: (Modified) VerificationResult.attestation.sourceSignature

ExampleScenarioProcessComponent.ExampleScenarioProcessStepComponent.ExampleScenarioProcessStepAlternativeComponentStepProcess.ExampleScenarioProcessStepComponentProcess
type: Class
comment: Indicates that the step is a complex sub-process with its own steps.
subclass of: BackboneElement
title: Step is nested process

abnormalCodedValueSet
type: ObjectProperty
comment: ObservationDefinition.component.qualifiedValue.abnormalCodedValueSet: The set of abnormal coded results for qualitative observations that match the criteria of this set of qualified values.
comment: ObservationDefinition.qualifiedValue.abnormalCodedValueSet: The set of abnormal coded results for qualitative observations that match the criteria of this set of qualified values.
modifierExtensionProperty: abnormalCodedValueSet
title: ObservationDefinition.component.qualifiedValue.abnormalCodedValueSet: Value set of abnormal coded values as part of this set of qualified values
title: ObservationDefinition.qualifiedValue.abnormalCodedValueSet: Value set of abnormal coded values as part of this set of qualified values

lastOccurrenceDate
type: ObjectProperty
comment: Appointment.recurrenceTemplate.lastOccurrenceDate: Recurring appointments will not occur after this date.
modifierExtensionProperty: lastOccurrenceDate
title: Appointment.recurrenceTemplate.lastOccurrenceDate: The date when the recurrence should end

_securityLabelNumber
type: ObjectProperty
comment: (Modified) Contract.term.asset.valuedItem.securityLabelNumber
comment: (Modified) Contract.term.group.offer.securityLabelNumber
comment: (Modified) Contract.term.asset.securityLabelNumber
comment: (Modified) Contract.term.offer.securityLabelNumber
comment: (Modified) Contract.term.action.securityLabelNumber
comment: (Modified) Contract.term.group.asset.valuedItem.securityLabelNumber
comment: (Modified) Contract.term.group.action.securityLabelNumber
comment: (Modified) Contract.term.group.asset.securityLabelNumber

_queryCriteria
type: ObjectProperty
comment: (Modified) SubscriptionTopic.resourceTrigger.queryCriteria

_multipleResultsAllowed
type: ObjectProperty
comment: (Modified) ObservationDefinition.multipleResultsAllowed

_allowed
type: ObjectProperty
comment: (Modified) MedicationRequest.substitution.allowed
comment: (Modified) MedicationKnowledge.regulatory.substitution.allowed
comment: (Modified) ExplanationOfBenefit.benefitBalance.financial.allowed
comment: (Modified) CoverageEligibilityResponse.insurance.item.benefit.allowed

_TestReport
type: Class
comment: (Modified) TestReport
subclass of: DomainResource

_Location
type: Class
comment: (Modified) Location
subclass of: DomainResource

deviceName
type: ObjectProperty
comment: DeviceDefinition.deviceName: The name or names of the device as given by the manufacturer.
modifierExtensionProperty: _deviceName
title: DeviceDefinition.deviceName: The name or names of the device as given by the manufacturer

ImmunizationReactionComponent
type: Class
comment: ImmunizationReactionComponent: Categorical data indicating that an adverse event is associated in time to an immunization.
subclass of: BackboneElement
subclass of: Restriction
  all values from: boolean
  on property: reported
subclass of: Restriction
  all values from: dateTime
  on property: date
subclass of: Restriction
  max cardinality: 1
  on property: reported
subclass of: Restriction
  max cardinality: 1
  on property: manifestation
subclass of: Restriction
  max cardinality: 1
  on property: date
subclass of: Restriction
  all values from: CodeableReference
  on property: manifestation

ConceptMap
type: Class
comment: A statement of relationships from one set of concepts to one or more other concepts - either concepts in code systems, or data element/data element concepts, or classes in class models.
subclass of: conformance.terminology
subclass of: MetadataResource
subclass of: Restriction
  max cardinality: 1
  on property: purpose
subclass of: Restriction
  all values from: date
  on property: approvalDate
subclass of: Restriction
  max cardinality: 1
  on property: title
subclass of: Restriction
  all values from: CodeableConcept
  on property: jurisdiction
subclass of: Restriction
  max cardinality: 1
  on property: date
subclass of: Restriction
  max cardinality: 1
  on property: version
subclass of: Restriction
  all values from: ContactDetail
  on property: editor
subclass of: Restriction
  all values from: string
  on property: name
subclass of: Restriction
  all values from: markdown
  on property: description
subclass of: Restriction
  all values from: ContactDetail
  on property: author
subclass of: Restriction
  all values from: Identifier
  on property: identifier
subclass of: Restriction
  all values from: ConceptMapGroupComponent
  on property: group
subclass of: Restriction
  max cardinality: 1
  on property: name
subclass of: Restriction
  all values from: Period
  on property: effectivePeriod
subclass of: Restriction
  cardinality: 1
  on property: status
subclass of:
  union of: Restriction
    all values from: uri
    on property: targetScope
  union of: Restriction
    max cardinality: 1
    on property: targetScope
  union of: Restriction
    all values from: canonical
    on property: targetScope
  union of: Restriction
    max cardinality: 1
    on property: targetScope
subclass of: Restriction
  all values from: markdown
  on property: purpose
subclass of: Restriction
  all values from: string
  on property: publisher
subclass of: Restriction
  all values from: Property
  on property: property
subclass of: Restriction
  max cardinality: 1
  on property: copyrightLabel
subclass of: Restriction
  all values from: markdown
  on property: copyright
subclass of: Restriction
  max cardinality: 1
  on property: publisher
subclass of: Restriction
  all values from: string
  on property: version
subclass of: Restriction
  max cardinality: 1
  on property: lastReviewDate
subclass of: Restriction
  all values from: string
  on property: copyrightLabel
subclass of: Restriction
  max cardinality: 1
  on property: effectivePeriod
subclass of: Restriction
  all values from: CodeableConcept
  on property: topic
subclass of: Restriction
  max cardinality: 1
  on property: experimental
subclass of:
  union of: Restriction
    all values from: uri
    on property: sourceScope
  union of: Restriction
    max cardinality: 1
    on property: sourceScope
  union of: Restriction
    all values from: canonical
    on property: sourceScope
  union of: Restriction
    max cardinality: 1
    on property: sourceScope
subclass of: Restriction
  all values from: AdditionalAttribute
  on property: additionalAttribute
subclass of: Restriction
  max cardinality: 1
  on property: copyright
subclass of: Restriction
  max cardinality: 1
  on property: description
subclass of: Restriction
  max cardinality: 1
  on property: approvalDate
subclass of: Restriction
  all values from: code
  on property: status
subclass of: Restriction
  all values from: ContactDetail
  on property: endorser
subclass of: Restriction
  all values from: boolean
  on property: experimental
subclass of: Restriction
  all values from: uri
  on property: url
subclass of: Restriction
  all values from: RelatedArtifact
  on property: relatedArtifact
subclass of: Restriction
  max cardinality: 1
  on property: url
subclass of: Restriction
  all values from: UsageContext
  on property: useContext
subclass of: Restriction
  all values from: date
  on property: lastReviewDate
subclass of: Restriction
  all values from: ContactDetail
  on property: reviewer
subclass of: Restriction
  all values from: string
  on property: title
subclass of: Restriction
  all values from: ContactDetail
  on property: contact
subclass of: Restriction
  all values from: dateTime
  on property: date
subclass of:
  union of: Restriction
    all values from: string
    on property: versionAlgorithm
  union of: Restriction
    max cardinality: 1
    on property: versionAlgorithm
  union of: Restriction
    all values from: Coding
    on property: versionAlgorithm
  union of: Restriction
    max cardinality: 1
    on property: versionAlgorithm

_daysOfWeek
type: ObjectProperty
comment: (Modified) Availability.availableTime.daysOfWeek

Contract.TermTermTerm
type: Class
comment: Nested group of Contract Provisions.
subclass of: BackboneElement
title: Nested Contract Term Group

ParameterDefinition
type: Class
comment: The parameters to the module. This collection specifies both the input and output parameters. Input parameters are provided by the caller as part of the $evaluate operation. Output parameters are included in the GuidanceResponse.
subclass of: DataType
subclass of: Restriction
  all values from: string
  on property: documentation
subclass of: Restriction
  all values from: code
  on property: use
subclass of: Restriction
  max cardinality: 1
  on property: name
subclass of: Restriction
  all values from: string
  on property: max
subclass of: Restriction
  cardinality: 1
  on property: type
subclass of: Restriction
  all values from: code
  on property: name
subclass of: Restriction
  cardinality: 1
  on property: use
subclass of: Restriction
  all values from: code
  on property: type
subclass of: Restriction
  all values from: integer
  on property: min
subclass of: Restriction
  max cardinality: 1
  on property: documentation
subclass of: Restriction
  max cardinality: 1
  on property: profile
subclass of: Restriction
  max cardinality: 1
  on property: max
subclass of: Restriction
  max cardinality: 1
  on property: min
subclass of: Restriction
  all values from: canonical
  on property: profile
title: Definition of a parameter to a module

_packageCode
type: ObjectProperty
comment: (Modified) Account.procedure.packageCode
comment: (Modified) Account.diagnosis.packageCode

Insurance
type: Class
comment: ExplanationOfBenefit.Insurance: Financial instruments for reimbursement for the health care products and services specified on the claim.
comment: CoverageEligibilityResponse.Insurance: Financial instruments for reimbursement for the health care products and services.
comment: CoverageEligibilityRequest.Insurance: Financial instruments for reimbursement for the health care products and services.
comment: ClaimResponse.Insurance: Financial instruments for reimbursement for the health care products and services specified on the claim.
comment: Claim.Insurance: Financial instruments for reimbursement for the health care products and services specified on the claim.
subclass of: BackboneElement
subclass of: Restriction
  cardinality: 1
  on property: focal
subclass of: Restriction
  all values from: Reference
  on property: coverage
subclass of: Restriction
  all values from: Period
  on property: benefitPeriod
subclass of: Restriction
  all values from: Reference
  on property: coverage
subclass of: Restriction
  max cardinality: 1
  on property: businessArrangement
subclass of: Restriction
  cardinality: 1
  on property: coverage
subclass of: Restriction
  max cardinality: 1
  on property: businessArrangement
subclass of: Restriction
  max cardinality: 1
  on property: inforce
subclass of: Restriction
  max cardinality: 1
  on property: identifier
subclass of: Restriction
  all values from: positiveInt
  on property: sequence
subclass of: Restriction
  cardinality: 1
  on property: sequence
subclass of: Restriction
  all values from: string
  on property: preAuthRef
subclass of: Restriction
  all values from: string
  on property: businessArrangement
subclass of: Restriction
  all values from: Reference
  on property: coverage
subclass of: Restriction
  cardinality: 1
  on property: focal
subclass of: Restriction
  max cardinality: 1
  on property: claimResponse
subclass of: Restriction
  cardinality: 1
  on property: coverage
subclass of: Restriction
  cardinality: 1
  on property: coverage
subclass of: Restriction
  all values from: Reference
  on property: coverage
subclass of: Restriction
  max cardinality: 1
  on property: focal
subclass of: Restriction
  all values from: Reference
  on property: claimResponse
subclass of: Restriction
  all values from: positiveInt
  on property: sequence
subclass of: Restriction
  max cardinality: 1
  on property: businessArrangement
subclass of: Restriction
  all values from: Identifier
  on property: identifier
subclass of: Restriction
  cardinality: 1
  on property: focal
subclass of: Restriction
  all values from: boolean
  on property: focal
subclass of: Restriction
  max cardinality: 1
  on property: claimResponse
subclass of: Restriction
  all values from: string
  on property: businessArrangement
subclass of: Restriction
  all values from: boolean
  on property: focal
subclass of: Restriction
  all values from: Items
  on property: item
subclass of: Restriction
  all values from: string
  on property: businessArrangement
subclass of: Restriction
  all values from: boolean
  on property: focal
subclass of: Restriction
  all values from: boolean
  on property: focal
subclass of: Restriction
  all values from: Reference
  on property: coverage
subclass of: Restriction
  cardinality: 1
  on property: coverage
subclass of: Restriction
  all values from: Reference
  on property: claimResponse
subclass of: Restriction
  cardinality: 1
  on property: sequence
subclass of: Restriction
  max cardinality: 1
  on property: benefitPeriod
subclass of: Restriction
  all values from: string
  on property: preAuthRef
subclass of: Restriction
  all values from: boolean
  on property: inforce
subclass of: Restriction
  cardinality: 1
  on property: coverage

lastPerformed
type: ObjectProperty
comment: VerificationResult.lastPerformed: The date/time validation was last completed (including failed validations).
modifierExtensionProperty: lastPerformed
title: VerificationResult.lastPerformed: The date/time validation was last completed (including failed validations)

IngredientManufacturerComponent
type: Class
comment: IngredientManufacturerComponent: The organization(s) that manufacture this ingredient. Can be used to indicate: 1) Organizations we are aware of that manufacture this ingredient 2) Specific Manufacturer(s) currently being used 3) Set of organisations allowed to manufacture this ingredient for this product Users must be clear on the application of context relevant to their use case.
subclass of: BackboneElement
subclass of: Restriction
  cardinality: 1
  on property: manufacturer
subclass of: Restriction
  all values from: Reference
  on property: manufacturer
subclass of: Restriction
  max cardinality: 1
  on property: role
subclass of: Restriction
  all values from: code
  on property: role

nthWeekOfMonth
type: ObjectProperty
comment: Appointment.recurrenceTemplate.monthlyTemplate.nthWeekOfMonth: Indicates which week within a month the appointments in the series of recurring appointments should occur on.
modifierExtensionProperty: _nthWeekOfMonth
title: Appointment.recurrenceTemplate.monthlyTemplate.nthWeekOfMonth: Indicates which week of the month the appointment should occur

targetSpecies
type: ObjectProperty
comment: AdministrableProductDefinition.routeOfAdministration.targetSpecies: A species for which this route applies.
modifierExtensionProperty: targetSpecies
title: AdministrableProductDefinition.routeOfAdministration.targetSpecies: A species for which this route applies

authorization
type: ObjectProperty
comment: AuditEvent.entity.agent.authorization: The authorization (e.g., PurposeOfUse) that was used during the event being recorded.
comment: PaymentReconciliation.authorization: An alphanumeric issued by the processor to confirm the successful issuance of payment.
comment: AuditEvent.authorization: The authorization (e.g., PurposeOfUse) that was used during the event being recorded.
comment: AuditEvent.agent.authorization: The authorization (e.g., PurposeOfUse) that was used during the event being recorded.
comment: Provenance.authorization: The authorization (e.g., PurposeOfUse) that was used during the event being recorded.
sub property of: why
modifierExtensionProperty: authorization
title: PaymentReconciliation.authorization: Authorization number
title: AuditEvent.entity.agent.authorization: Allowable authorization for this agent
title: AuditEvent.agent.authorization: Allowable authorization for this agent
title: Provenance.authorization: Authorization (purposeOfUse) related to the event
title: AuditEvent.authorization: Authorization related to the event

_RequestOrchestration
type: Class
comment: (Modified) RequestOrchestration
subclass of: DomainResource

_endpoint
type: ObjectProperty
comment: (Modified) CapabilityStatement.messaging.endpoint
comment: (Modified) Subscription.endpoint
comment: (Modified) ImagingStudy.endpoint
comment: (Modified) InsurancePlan.endpoint
comment: (Modified) PractitionerRole.endpoint
comment: (Modified) Location.endpoint
comment: (Modified) ImagingStudy.series.endpoint
comment: (Modified) Device.endpoint
comment: (Modified) OrganizationAffiliation.endpoint
comment: (Modified) Organization.endpoint
comment: (Modified) ImagingSelection.endpoint
comment: (Modified) HealthcareService.endpoint
comment: (Modified) MessageHeader.destination.endpoint
comment: (Modified) MessageHeader.source.endpoint

triggeredBy
type: ObjectProperty
comment: Observation.triggeredBy: Identifies the observation(s) that triggered the performance of this observation.
modifierExtensionProperty: triggeredBy
title: Observation.triggeredBy: Triggering observation(s)

_Dosage
type: Class
comment: (Modified) Dosage
subclass of: BackboneType

_doNotPerform
type: ObjectProperty
comment: (Modified) Contract.term.group.action.doNotPerform
comment: (Modified) Contract.term.action.doNotPerform
comment: (Modified) CommunicationRequest.doNotPerform
comment: (Modified) DeviceRequest.doNotPerform
comment: (Modified) ServiceRequest.doNotPerform
comment: (Modified) MedicationRequest.doNotPerform
comment: (Modified) Task.doNotPerform
comment: (Modified) ActivityDefinition.doNotPerform

careTeam
type: ObjectProperty
comment: ExplanationOfBenefit.careTeam: The members of the team who provided the products and services.
comment: CarePlan.careTeam: Identifies all people and organizations who are expected to be involved in the care envisioned by this plan.
comment: EpisodeOfCare.careTeam: The list of practitioners that may be facilitating this episode of care for specific purposes.
comment: Encounter.careTeam: The group(s) of individuals, organizations that are allocated to participate in this encounter. The participants backbone will record the actuals of when these individuals participated during the encounter.
comment: Claim.careTeam: The members of the team who provided the products and services.
sub property of: who.actor
modifierExtensionProperty: _careTeam
title: Claim.careTeam: Members of the care team
title: EpisodeOfCare.careTeam: Other practitioners facilitating this episode of care
title: ExplanationOfBenefit.careTeam: Care Team members
title: Encounter.careTeam: The group(s) that are allocated to participate in this encounter
title: CarePlan.careTeam: Who's involved in plan?

_meta
type: ObjectProperty
comment: (Modified) Resource.meta

TerminologyCapabilitiesCodeSystemVersionComponent
type: Class
comment: TerminologyCapabilitiesCodeSystemComponent.TerminologyCapabilitiesCodeSystemVersionComponent: For the code system, a list of versions that are supported by the server.
subclass of: BackboneElement
subclass of: Restriction
  all values from: string
  on property: code
subclass of: Restriction
  all values from: boolean
  on property: isDefault
subclass of: Restriction
  all values from: boolean
  on property: compositional
subclass of: Restriction
  max cardinality: 1
  on property: isDefault
subclass of: Restriction
  all values from: code
  on property: language
subclass of: Restriction
  all values from: code
  on property: property
subclass of: Restriction
  max cardinality: 1
  on property: compositional
subclass of: Restriction
  max cardinality: 1
  on property: code
subclass of: Restriction
  all values from: TerminologyCapabilitiesCodeSystemVersionFilterComponent
  on property: filter

entryQuantity
type: ObjectProperty
comment: EvidenceReport.section.section.entryQuantity: Quantity as content.
comment: EvidenceReport.section.entryQuantity: Quantity as content.
modifierExtensionProperty: entryQuantity
title: EvidenceReport.section.section.entryQuantity: Quantity as content
title: EvidenceReport.section.entryQuantity: Quantity as content

CapabilityStatementMessagingEndpointComponent
type: Class
comment: CapabilityStatementMessagingComponent.CapabilityStatementMessagingEndpointComponent: An endpoint (network accessible address) to which messages and/or replies are to be sent.
subclass of: BackboneElement
subclass of: Restriction
  cardinality: 1
  on property: address
subclass of: Restriction
  all values from: url
  on property: address
subclass of: Restriction
  cardinality: 1
  on property: protocol
subclass of: Restriction
  all values from: Coding
  on property: protocol

nTerminalModification
type: ObjectProperty
comment: SubstanceProtein.subunit.nTerminalModification: The name of the fragment modified at the N-terminal of the SubstanceProtein shall be specified.
modifierExtensionProperty: _nTerminalModification
title: SubstanceProtein.subunit.nTerminalModification: The name of the fragment modified at the N-terminal of the SubstanceProtein shall be specified

_asNeededFor
type: ObjectProperty
comment: (Modified) NutritionOrder.enteralFormula.administration.schedule.asNeededFor
comment: (Modified) NutritionOrder.supplement.schedule.asNeededFor
comment: (Modified) NutritionOrder.oralDiet.schedule.asNeededFor
comment: (Modified) DeviceRequest.asNeededFor
comment: (Modified) Dosage.asNeededFor

_link
type: ObjectProperty
comment: (Modified) Bundle.link
comment: (Modified) Bundle.entry.link
comment: (Modified) TestScript.setup.action.assert.requirement.link
comment: (Modified) Patient.link
comment: (Modified) Person.link
comment: (Modified) TestScript.metadata.link
comment: (Modified) TestReport.test.action.assert.requirement.link
comment: (Modified) DeviceDefinition.link
comment: (Modified) TestScript.test.action.assert.requirement.link
comment: (Modified) GraphDefinition.link
comment: (Modified) TestReport.setup.action.assert.requirement.link
comment: (Modified) TestScript.metadata.capability.link
comment: (Modified) DiagnosticReport.media.link

attribute
type: ObjectProperty
comment: ConceptMap.group.element.target.product.attribute: A reference to the additional attribute that holds a value the map depends on.
comment: ConceptMap.group.element.target.dependsOn.attribute: A reference to the additional attribute that holds a value the map depends on.
modifierExtensionProperty: attribute
title: ConceptMap.group.element.target.product.attribute: A reference to a mapping attribute defined in ConceptMap.additionalAttribute
title: ConceptMap.group.element.target.dependsOn.attribute: A reference to a mapping attribute defined in ConceptMap.additionalAttribute

Note
type: Class
comment: ExplanationOfBenefit.Note: A note that describes or explains adjudication results in a human readable form.
comment: ClaimResponse.Note: A note that describes or explains adjudication results in a human readable form.
subclass of: BackboneElement
subclass of: Restriction
  all values from: CodeableConcept
  on property: language
subclass of: Restriction
  max cardinality: 1
  on property: text
subclass of: Restriction
  max cardinality: 1
  on property: number
subclass of: Restriction
  max cardinality: 1
  on property: type
subclass of: Restriction
  all values from: positiveInt
  on property: number
subclass of: Restriction
  max cardinality: 1
  on property: number
subclass of: Restriction
  all values from: CodeableConcept
  on property: language
subclass of: Restriction
  max cardinality: 1
  on property: language
subclass of: Restriction
  all values from: CodeableConcept
  on property: type
subclass of: Restriction
  all values from: string
  on property: text
subclass of: Restriction
  all values from: positiveInt
  on property: number
subclass of: Restriction
  all values from: string
  on property: text
subclass of: Restriction
  all values from: CodeableConcept
  on property: type
subclass of: Restriction
  max cardinality: 1
  on property: language
subclass of: Restriction
  cardinality: 1
  on property: text
subclass of: Restriction
  max cardinality: 1
  on property: type

textFilter
type: ObjectProperty
comment: TerminologyCapabilities.expansion.textFilter: Documentation about text searching works.
modifierExtensionProperty: _textFilter
title: TerminologyCapabilities.expansion.textFilter: Documentation about text searching works

disposition
type: ObjectProperty
comment: ExplanationOfBenefit.disposition: A human readable description of the status of the adjudication.
comment: CoverageEligibilityResponse.disposition: A human readable description of the status of the adjudication.
comment: ClaimResponse.disposition: A human readable description of the status of the adjudication.
comment: PaymentReconciliation.disposition: A human readable description of the status of the request for the reconciliation.
comment: EnrollmentResponse.disposition: A description of the status of the adjudication.
comment: ArtifactAssessment.disposition: Indicates the disposition of the responsible party to the comment or change request.
modifierExtensionProperty: disposition
title: EnrollmentResponse.disposition: Disposition Message
title: PaymentReconciliation.disposition: Disposition message
title: CoverageEligibilityResponse.disposition: Disposition Message
title: ClaimResponse.disposition: Disposition Message
title: ArtifactAssessment.disposition: unresolved | not-persuasive | persuasive | persuasive-with-modification | not-persuasive-with-modification
title: ExplanationOfBenefit.disposition: Disposition Message

PackagedProductDefinition
type: Class
comment: A medically related item or items, in a container or package.
subclass of: DomainResource
subclass of: administrative.medication
subclass of: Restriction
  max cardinality: 1
  on property: copackagedIndicator
subclass of: Restriction
  all values from: Reference
  on property: attachedDocument
subclass of: Restriction
  all values from: PackagedProductDefinitionPackagingComponent
  on property: packaging
subclass of: Restriction
  all values from: dateTime
  on property: statusDate
subclass of: Restriction
  max cardinality: 1
  on property: statusDate
subclass of: Restriction
  all values from: Identifier
  on property: identifier
subclass of: Restriction
  max cardinality: 1
  on property: name
subclass of: Restriction
  all values from: Reference
  on property: packageFor
subclass of: Restriction
  all values from: Reference
  on property: manufacturer
subclass of: Restriction
  max cardinality: 1
  on property: type
subclass of: Restriction
  all values from: CodeableConcept
  on property: type
subclass of: Restriction
  all values from: string
  on property: name
subclass of: Restriction
  all values from: boolean
  on property: copackagedIndicator
subclass of: Restriction
  all values from: PackagedProductDefinitionLegalStatusOfSupplyComponent
  on property: legalStatusOfSupply
subclass of: Restriction
  max cardinality: 1
  on property: packaging
subclass of: Restriction
  all values from: markdown
  on property: description
subclass of: Restriction
  max cardinality: 1
  on property: description
subclass of: Restriction
  all values from: Quantity
  on property: containedItemQuantity
subclass of: Restriction
  all values from: CodeableConcept
  on property: status
subclass of: Restriction
  all values from: PackagedProductDefinitionProperty
  on property: characteristic
subclass of: Restriction
  max cardinality: 1
  on property: status
subclass of: Restriction
  all values from: MarketingStatus
  on property: marketingStatus
modifierExtensionClass: _PackagedProductDefinition

Accident
type: Class
comment: ExplanationOfBenefit.Accident: Details of a accident which resulted in injuries which required the products and services listed in the claim.
comment: Claim.Accident: Details of an accident which resulted in injuries which required the products and services listed in the claim.
subclass of: BackboneElement
subclass of: Restriction
  max cardinality: 1
  on property: date
subclass of: Restriction
  all values from: CodeableConcept
  on property: type
subclass of:
  union of: Restriction
    all values from: Address
    on property: location
  union of: Restriction
    max cardinality: 1
    on property: location
  union of: Restriction
    all values from: Reference
    on property: location
  union of: Restriction
    max cardinality: 1
    on property: location
subclass of: Restriction
  max cardinality: 1
  on property: type
subclass of: Restriction
  cardinality: 1
  on property: date
subclass of: Restriction
  all values from: date
  on property: date
subclass of: Restriction
  all values from: date
  on property: date
subclass of:
  union of: Restriction
    all values from: Address
    on property: location
  union of: Restriction
    max cardinality: 1
    on property: location
  union of: Restriction
    all values from: Reference
    on property: location
  union of: Restriction
    max cardinality: 1
    on property: location
subclass of: Restriction
  max cardinality: 1
  on property: type
subclass of: Restriction
  all values from: CodeableConcept
  on property: type

_reference
type: ObjectProperty
comment: (Modified) Consent.provision.provision.data.reference
comment: (Modified) Reference.reference
comment: (Modified) Consent.policyBasis.reference
comment: (Modified) ActorDefinition.reference
comment: (Modified) Contract.term.group.asset.context.reference
comment: (Modified) Consent.provision.provision.actor.reference
comment: (Modified) ConditionDefinition.plan.reference
comment: (Modified) Contract.term.asset.context.reference
comment: (Modified) Requirements.reference
comment: (Modified) ResearchStudy.outcomeMeasure.reference
comment: (Modified) Contract.term.group.action.subject.reference
comment: (Modified) MedicationKnowledge.storageGuideline.reference
comment: (Modified) ConditionDefinition.questionnaire.reference
comment: (Modified) Contract.term.offer.party.reference
comment: (Modified) Contract.term.group.offer.party.reference
comment: (Modified) Expression.reference
comment: (Modified) DiagnosticReport.supportingInfo.reference
comment: (Modified) ImplementationGuide.manifest.resource.reference
comment: (Modified) Permission.rule.data.resource.reference
comment: (Modified) ImplementationGuide.definition.resource.reference
comment: (Modified) ExplanationOfBenefit.related.reference
comment: (Modified) DetectedIssue.reference
comment: (Modified) CodeableReference.reference
comment: (Modified) Consent.provision.data.reference
comment: (Modified) Requirements.statement.reference
comment: (Modified) Contract.term.action.subject.reference
comment: (Modified) Consent.provision.actor.reference
comment: (Modified) Claim.related.reference
comment: (Modified) MedicationKnowledge.relatedMedicationKnowledge.reference
comment: (Modified) DeviceDefinition.hasPart.reference

StructureMapGroupRuleTargetParameterComponent
type: Class
comment: StructureMapGroupComponent.StructureMapGroupRuleComponentRule.StructureMapGroupRuleTargetComponent.StructureMapGroupRuleTargetParameterComponent: Parameters to the transform.
comment: StructureMapGroupComponent.StructureMapGroupRuleComponent.StructureMapGroupRuleTargetComponent.StructureMapGroupRuleTargetParameterComponent: Parameters to the transform.
subclass of: BackboneElement
subclass of:
  union of: Restriction
    all values from: id
    on property: value
  union of: Restriction
    cardinality: 1
    on property: value
  union of: Restriction
    all values from: string
    on property: value
  union of: Restriction
    cardinality: 1
    on property: value
  union of: Restriction
    all values from: boolean
    on property: value
  union of: Restriction
    cardinality: 1
    on property: value
  union of: Restriction
    all values from: integer
    on property: value
  union of: Restriction
    cardinality: 1
    on property: value
  union of: Restriction
    all values from: decimal
    on property: value
  union of: Restriction
    cardinality: 1
    on property: value
  union of: Restriction
    all values from: date
    on property: value
  union of: Restriction
    cardinality: 1
    on property: value
  union of: Restriction
    all values from: time
    on property: value
  union of: Restriction
    cardinality: 1
    on property: value
  union of: Restriction
    all values from: dateTime
    on property: value
  union of: Restriction
    cardinality: 1
    on property: value
subclass of:
  union of: Restriction
    all values from: id
    on property: value
  union of: Restriction
    cardinality: 1
    on property: value
  union of: Restriction
    all values from: string
    on property: value
  union of: Restriction
    cardinality: 1
    on property: value
  union of: Restriction
    all values from: boolean
    on property: value
  union of: Restriction
    cardinality: 1
    on property: value
  union of: Restriction
    all values from: integer
    on property: value
  union of: Restriction
    cardinality: 1
    on property: value
  union of: Restriction
    all values from: decimal
    on property: value
  union of: Restriction
    cardinality: 1
    on property: value
  union of: Restriction
    all values from: date
    on property: value
  union of: Restriction
    cardinality: 1
    on property: value
  union of: Restriction
    all values from: time
    on property: value
  union of: Restriction
    cardinality: 1
    on property: value
  union of: Restriction
    all values from: dateTime
    on property: value
  union of: Restriction
    cardinality: 1
    on property: value

subscriber
type: ObjectProperty
comment: Coverage.subscriber: The party who has signed-up for or 'owns' the contractual relationship to the policy or to whom the benefit of the policy for services rendered to them or their family is due.
sub property of: who.focus
modifierExtensionProperty: _subscriber
title: Coverage.subscriber: Subscriber to the policy

structureType
type: ObjectProperty
comment: ExampleScenario.instance.structureType: A code indicating the kind of data structure (FHIR resource or some other standard) this is an instance of.
modifierExtensionProperty: structureType
title: ExampleScenario.instance.structureType: Data structure for example

_detail
type: ObjectProperty
comment: (Modified) TestReport.setup.action.operation.detail
comment: (Modified) DetectedIssue.detail
comment: (Modified) ClaimResponse.item.detail
comment: (Modified) Goal.target.detail
comment: (Modified) ExplanationOfBenefit.addItem.detail
comment: (Modified) TestReport.teardown.action.operation.detail
comment: (Modified) DetectedIssue.evidence.detail
comment: (Modified) TestReport.setup.action.assert.detail
comment: (Modified) Claim.item.detail
comment: (Modified) ExplanationOfBenefit.item.detail
comment: (Modified) AuditEvent.outcome.detail
comment: (Modified) CoverageEligibilityRequest.item.detail
comment: (Modified) AuditEvent.entity.detail
comment: (Modified) ClaimResponse.addItem.detail
comment: (Modified) Composition.event.detail
comment: (Modified) TestReport.test.action.operation.detail
comment: (Modified) TestReport.test.action.assert.detail
comment: (Modified) PlanDefinition.goal.target.detail

meaningWhenMissing
type: ObjectProperty
comment: ElementDefinition.meaningWhenMissing: The Implicit meaning that is to be understood when this element is missing (e.g. 'when this element is missing, the period is ongoing').
modifierExtensionProperty: meaningWhenMissing
title: ElementDefinition.meaningWhenMissing: Implicit meaning when this element is missing

modelCharacteristic
type: ObjectProperty
comment: Evidence.statistic.modelCharacteristic: A component of the method to generate the statistic.
modifierExtensionProperty: modelCharacteristic
title: Evidence.statistic.modelCharacteristic: An aspect of the statistical model

mapping
type: ObjectProperty
comment: StructureDefinition.mapping: An external specification that the content is mapped to.
comment: ElementDefinition.mapping: Identifies a concept from an external specification that roughly corresponds to this element.
modifierExtensionProperty: mapping
title: StructureDefinition.mapping: External specification that the content is mapped to
title: ElementDefinition.mapping: Map element to another set of definitions

_Person
type: Class
comment: (Modified) Person
subclass of: DomainResource

_eligibility
type: ObjectProperty
comment: (Modified) ResearchStudy.recruitment.eligibility
comment: (Modified) HealthcareService.eligibility

SubstanceSourceMaterialFractionDescriptionComponent
type: Class
comment: SubstanceSourceMaterialFractionDescriptionComponent: Many complex materials are fractions of parts of plants, animals, or minerals. Fraction elements are often necessary to define both Substances and Specified Group 1 Substances. For substances derived from Plants, fraction information will be captured at the Substance information level ( . Oils, Juices and Exudates). Additional information for Extracts, such as extraction solvent composition, will be captured at the Specified Substance Group 1 information level. For plasma-derived products fraction information will be captured at the Substance and the Specified Substance Group 1 levels.
subclass of: BackboneElement
subclass of: Restriction
  max cardinality: 1
  on property: materialType
subclass of: Restriction
  all values from: CodeableConcept
  on property: materialType
subclass of: Restriction
  max cardinality: 1
  on property: fraction
subclass of: Restriction
  all values from: string
  on property: fraction

typeCollected
type: ObjectProperty
comment: SpecimenDefinition.typeCollected: The kind of material to be collected.
modifierExtensionProperty: typeCollected
title: SpecimenDefinition.typeCollected: Kind of material to collect

timestamp
type: ObjectProperty
comment: ValueSet.expansion.timestamp: The time at which the expansion was produced by the expanding system.
comment: Bundle.timestamp: The date/time that the bundle was assembled - i.e. when the resources were placed in the bundle.
comment: SubscriptionStatus.notificationEvent.timestamp: The actual time this event occurred on the server.
sub property of: when.init
modifierExtensionProperty: timestamp
title: ValueSet.expansion.timestamp: Time ValueSet expansion happened
title: SubscriptionStatus.notificationEvent.timestamp: The instant this event occurred
title: Bundle.timestamp: When the bundle was assembled

_subpotentReason
type: ObjectProperty
comment: (Modified) Immunization.subpotentReason

_relatedMedicationKnowledge
type: ObjectProperty
comment: (Modified) MedicationKnowledge.relatedMedicationKnowledge

_inventoryStatus
type: ObjectProperty
comment: (Modified) InventoryItem.inventoryStatus

synonym
type: ObjectProperty
comment: SubstanceDefinition.name.translation.synonym: A synonym of this particular name, by which the substance is also known.
comment: SubstanceDefinition.name.synonym: A synonym of this particular name, by which the substance is also known.
comment: SubstanceDefinition.name.synonym.synonym: A synonym of this particular name, by which the substance is also known.
modifierExtensionProperty: synonym
title: SubstanceDefinition.name.translation.synonym: A synonym of this particular name, by which the substance is also known
title: SubstanceDefinition.name.synonym: A synonym of this particular name, by which the substance is also known
title: SubstanceDefinition.name.synonym.synonym: A synonym of this particular name, by which the substance is also known

_category
type: ObjectProperty
comment: (Modified) DeviceDefinition.conformsTo.category
comment: (Modified) AllergyIntolerance.category
comment: (Modified) CarePlan.category
comment: (Modified) MedicationStatement.category
comment: (Modified) Composition.category
comment: (Modified) DeviceMetric.category
comment: (Modified) Contract.term.group.securityLabel.category
comment: (Modified) MedicationDispense.category
comment: (Modified) MedicationAdministration.category
comment: (Modified) CoverageEligibilityRequest.item.category
comment: (Modified) ExplanationOfBenefit.supportingInfo.category
comment: (Modified) SubstancePolymer.monomerSet.startingMaterial.category
comment: (Modified) AuditEvent.category
comment: (Modified) EvidenceVariable.category
comment: (Modified) CareTeam.category
comment: (Modified) ConditionDefinition.medication.category
comment: (Modified) DeviceAssociation.category
comment: (Modified) Substance.category
comment: (Modified) ExplanationOfBenefit.item.detail.category
comment: (Modified) TestPlan.category
comment: (Modified) NutritionProduct.category
comment: (Modified) ClaimResponse.adjudication.category
comment: (Modified) InsurancePlan.plan.specificCost.category
comment: (Modified) ExplanationOfBenefit.total.category
comment: (Modified) AdverseEvent.category
comment: (Modified) Device.category
comment: (Modified) ExplanationOfBenefit.addItem.detail.adjudication.category
comment: (Modified) ClaimResponse.item.adjudication.category
comment: (Modified) DeviceDispense.category
comment: (Modified) ExplanationOfBenefit.addItem.detail.subDetail.adjudication.category
comment: (Modified) Observation.category
comment: (Modified) ClaimResponse.addItem.detail.subDetail.adjudication.category
comment: (Modified) ClaimResponse.addItem.adjudication.category
comment: (Modified) InventoryItem.category
comment: (Modified) DetectedIssue.category
comment: (Modified) Flag.category
comment: (Modified) ClaimResponse.item.detail.adjudication.category
comment: (Modified) Claim.item.detail.subDetail.category
comment: (Modified) ImagingSelection.category
comment: (Modified) ExplanationOfBenefit.addItem.adjudication.category
comment: (Modified) Evidence.statistic.category
comment: (Modified) Device.conformsTo.category
comment: (Modified) Claim.supportingInfo.category
comment: (Modified) Condition.category
comment: (Modified) Procedure.category
comment: (Modified) ObservationDefinition.category
comment: (Modified) ClaimResponse.item.detail.subDetail.adjudication.category
comment: (Modified) DocumentReference.category
comment: (Modified) Goal.category
comment: (Modified) Consent.category
comment: (Modified) ClaimResponse.addItem.detail.adjudication.category
comment: (Modified) ExplanationOfBenefit.item.category
comment: (Modified) ExplanationOfBenefit.item.detail.subDetail.category
comment: (Modified) ConditionDefinition.observation.category
comment: (Modified) ClinicalUseDefinition.category
comment: (Modified) HealthcareService.category
comment: (Modified) MessageDefinition.category
comment: (Modified) DiagnosticReport.category
comment: (Modified) ClaimResponse.total.category
comment: (Modified) ExplanationOfBenefit.item.detail.subDetail.adjudication.category
comment: (Modified) ExplanationOfBenefit.item.adjudication.category
comment: (Modified) Communication.category
comment: (Modified) PlanDefinition.goal.category
comment: (Modified) DeviceUsage.category
comment: (Modified) ServiceRequest.category
comment: (Modified) CommunicationRequest.category
comment: (Modified) MedicationRequest.category
comment: (Modified) CoverageEligibilityResponse.insurance.item.category
comment: (Modified) Claim.item.detail.category
comment: (Modified) ExplanationOfBenefit.item.detail.adjudication.category
comment: (Modified) Claim.item.category
comment: (Modified) ExplanationOfBenefit.adjudication.category
comment: (Modified) SupplyRequest.category
comment: (Modified) ExplanationOfBenefit.benefitBalance.category
comment: (Modified) Coverage.costToBeneficiary.category
comment: (Modified) InventoryReport.inventoryListing.item.category
comment: (Modified) Contract.term.securityLabel.category

_regulatory
type: ObjectProperty
comment: (Modified) MedicationKnowledge.regulatory

birthDate
type: ObjectProperty
comment: Practitioner.birthDate: The date of birth for the practitioner.
comment: Patient.birthDate: The date of birth for the individual.
comment: RelatedPerson.birthDate: The date on which the related person was born.
comment: Person.birthDate: The birth date for the person.
modifierExtensionProperty: birthDate
title: RelatedPerson.birthDate: The date on which the related person was born
title: Patient.birthDate: The date of birth for the individual
title: Practitioner.birthDate: The date on which the practitioner was born
title: Person.birthDate: The date on which the person was born

_priorPrescription
type: ObjectProperty
comment: (Modified) MedicationRequest.priorPrescription

Base
type: Class
comment: Base definition for all types defined in FHIR type system.
title: Base for all types and resources

_testTools
type: ObjectProperty
comment: (Modified) TestPlan.testTools

_targetLocation
type: ObjectProperty
comment: (Modified) VerificationResult.targetLocation

substanceDefinition
type: ObjectProperty
comment: SubstanceDefinition.relationship.substanceDefinition
modifierExtensionProperty: substanceDefinition

_medication
type: ObjectProperty
comment: (Modified) MedicationStatement.medication
comment: (Modified) MedicationRequest.medication
comment: (Modified) MedicationDispense.medication
comment: (Modified) MedicationAdministration.medication
comment: (Modified) ConditionDefinition.medication

_vaccineCode
type: ObjectProperty
comment: (Modified) ImmunizationRecommendation.recommendation.vaccineCode
comment: (Modified) Immunization.vaccineCode

_dateAsserted
type: ObjectProperty
comment: (Modified) MedicationStatement.dateAsserted
comment: (Modified) DeviceUsage.dateAsserted

DeviceDefinitionMaterialComponent
type: Class
comment: DeviceDefinitionMaterialComponent: A substance used to create the material(s) of which the device is made.
subclass of: BackboneElement
subclass of: Restriction
  max cardinality: 1
  on property: alternate
subclass of: Restriction
  cardinality: 1
  on property: substance
subclass of: Restriction
  all values from: boolean
  on property: allergenicIndicator
subclass of: Restriction
  all values from: CodeableConcept
  on property: substance
subclass of: Restriction
  max cardinality: 1
  on property: allergenicIndicator
subclass of: Restriction
  all values from: boolean
  on property: alternate

_codeSearch
type: ObjectProperty
comment: (Modified) TerminologyCapabilities.codeSearch

range
type: ObjectProperty
comment: ObservationDefinition.qualifiedValue.range: The range of values defined for continuous or ordinal observations that match the criteria of this set of qualified values.
comment: Evidence.statistic.modelCharacteristic.attributeEstimate.range: Lower bound of confidence interval.
comment: ObservationDefinition.component.qualifiedValue.range: The range of values defined for continuous or ordinal observations that match the criteria of this set of qualified values.
comment: EvidenceVariable.characteristic.definitionByCombination.characteristic.timeFromEvent.range: Used to express the observation within a period before and/or after the event.
comment: Evidence.statistic.attributeEstimate.attributeEstimate.range: Lower bound of confidence interval.
comment: Evidence.statistic.attributeEstimate.range: Lower bound of confidence interval.
comment: EvidenceVariable.characteristic.timeFromEvent.range: Used to express the observation within a period before and/or after the event.
modifierExtensionProperty: range
title: EvidenceVariable.characteristic.timeFromEvent.range: Used to express the observation within a period before and/or after the event
title: ObservationDefinition.component.qualifiedValue.range: The range for continuous or ordinal observations
title: ObservationDefinition.qualifiedValue.range: The range for continuous or ordinal observations
title: EvidenceVariable.characteristic.definitionByCombination.characteristic.timeFromEvent.range: Used to express the observation within a period before and/or after the event
title: Evidence.statistic.modelCharacteristic.attributeEstimate.range: Lower and upper bound values of the attribute estimate
title: Evidence.statistic.attributeEstimate.range: Lower and upper bound values of the attribute estimate
title: Evidence.statistic.attributeEstimate.attributeEstimate.range: Lower and upper bound values of the attribute estimate

NutritionOrder
type: Class
comment: A request to supply a diet, formula feeding (enteral) or oral nutritional supplement to a patient/resident.
subclass of: DomainResource
subclass of: clinical.careprovision
subclass of: Restriction
  all values from: Reference
  on property: supportingInformation
subclass of: Restriction
  all values from: code
  on property: priority
subclass of: Restriction
  cardinality: 1
  on property: dateTime
subclass of: Restriction
  all values from: CodeableConcept
  on property: excludeFoodModifier
subclass of: Restriction
  all values from: Identifier
  on property: identifier
subclass of: Restriction
  max cardinality: 1
  on property: encounter
subclass of: Restriction
  all values from: Reference
  on property: encounter
subclass of: Restriction
  all values from: canonical
  on property: instantiatesCanonical
subclass of: Restriction
  all values from: CodeableConcept
  on property: foodPreferenceModifier
subclass of: Restriction
  all values from: CodeableReference
  on property: performer
subclass of: Restriction
  all values from: NutritionOrderEnteralFormulaComponent
  on property: enteralFormula
subclass of: Restriction
  all values from: code
  on property: intent
subclass of: Restriction
  cardinality: 1
  on property: status
subclass of: Restriction
  all values from: code
  on property: status
subclass of: Restriction
  all values from: boolean
  on property: outsideFoodAllowed
subclass of: Restriction
  all values from: Identifier
  on property: groupIdentifier
subclass of: Restriction
  all values from: Reference
  on property: allergyIntolerance
subclass of: Restriction
  max cardinality: 1
  on property: groupIdentifier
subclass of: Restriction
  cardinality: 1
  on property: subject
subclass of: Restriction
  all values from: NutritionOrderOralDietComponent
  on property: oralDiet
subclass of: Restriction
  max cardinality: 1
  on property: orderer
subclass of: Restriction
  cardinality: 1
  on property: intent
subclass of: Restriction
  max cardinality: 1
  on property: enteralFormula
subclass of: Restriction
  all values from: uri
  on property: instantiatesUri
subclass of: Restriction
  max cardinality: 1
  on property: priority
subclass of: Restriction
  max cardinality: 1
  on property: outsideFoodAllowed
subclass of: Restriction
  all values from: Reference
  on property: subject
subclass of: Restriction
  max cardinality: 1
  on property: oralDiet
subclass of: Restriction
  all values from: Annotation
  on property: note
subclass of: Restriction
  all values from: Reference
  on property: orderer
subclass of: Restriction
  all values from: uri
  on property: instantiates
subclass of: Restriction
  all values from: NutritionOrderSupplementComponent
  on property: supplement
subclass of: Restriction
  all values from: dateTime
  on property: dateTime
subclass of: Restriction
  all values from: Reference
  on property: basedOn
modifierExtensionClass: _NutritionOrder

_dispenserInstruction
type: ObjectProperty
comment: (Modified) MedicationRequest.dispenseRequest.dispenserInstruction

_summary
type: ObjectProperty
comment: (Modified) Condition.stage.summary
comment: (Modified) ClinicalImpression.summary
comment: (Modified) Citation.citedArtifact.contributorship.summary
comment: (Modified) Citation.summary
comment: (Modified) ArtifactAssessment.content.component.summary
comment: (Modified) ArtifactAssessment.content.summary

_synthesisType
type: ObjectProperty
comment: (Modified) Evidence.synthesisType

productName
type: ObjectProperty
comment: NutritionOrder.enteralFormula.additive.productName: The product or brand name of the type of modular component to be added to the formula.
comment: NutritionOrder.supplement.productName: The product or brand name of the nutritional supplement such as "Acme Protein Shake".
comment: MedicinalProductDefinition.name.productName: The full product name.
modifierExtensionProperty: productName
title: NutritionOrder.enteralFormula.additive.productName: Product or brand name of the modular additive
title: NutritionOrder.supplement.productName: Product or brand name of the nutritional supplement
title: MedicinalProductDefinition.name.productName: The full product name

_reviewOutcome
type: ObjectProperty
comment: (Modified) ExplanationOfBenefit.addItem.detail.subDetail.reviewOutcome
comment: (Modified) ClaimResponse.addItem.detail.subDetail.reviewOutcome
comment: (Modified) ClaimResponse.addItem.detail.reviewOutcome
comment: (Modified) ClaimResponse.item.detail.reviewOutcome
comment: (Modified) ExplanationOfBenefit.item.reviewOutcome
comment: (Modified) ClaimResponse.item.reviewOutcome
comment: (Modified) ExplanationOfBenefit.addItem.reviewOutcome
comment: (Modified) ExplanationOfBenefit.item.detail.subDetail.reviewOutcome
comment: (Modified) ExplanationOfBenefit.addItem.detail.reviewOutcome
comment: (Modified) ClaimResponse.addItem.reviewOutcome
comment: (Modified) ExplanationOfBenefit.item.detail.reviewOutcome
comment: (Modified) ClaimResponse.item.detail.subDetail.reviewOutcome

claimResponse
type: ObjectProperty
comment: ExplanationOfBenefit.claimResponse: The business identifier for the instance of the adjudication response: claim, predetermination or preauthorization response.
comment: ClaimResponse.insurance.claimResponse: The result of the adjudication of the line items for the Coverage specified in this insurance.
comment: Claim.insurance.claimResponse: The result of the adjudication of the line items for the Coverage specified in this insurance.
modifierExtensionProperty: claimResponse
title: ExplanationOfBenefit.claimResponse: Claim response reference
title: ClaimResponse.insurance.claimResponse: Adjudication results
title: Claim.insurance.claimResponse: Adjudication results

path
type: ObjectProperty
comment: RequestOrchestration.action.dynamicValue.path: The path to the element to be customized. This is the path on the resource that will hold the result of the calculation defined by the expression. The specified path SHALL be a FHIRPath resolvable on the specified target type of the ActivityDefinition, and SHALL consist only of identifiers, constant indexers, and a restricted subset of functions. The path is allowed to contain qualifiers (.) to traverse sub-elements, as well as indexers ([x]) to traverse multiple-cardinality sub-elements (see the [Simple FHIRPath Profile](fhirpath.html#simple) for full details).
comment: PlanDefinition.action.dynamicValue.path: The path to the element to be customized. This is the path on the resource that will hold the result of the calculation defined by the expression. The specified path SHALL be a FHIRPath resolvable on the specified target type of the ActivityDefinition, and SHALL consist only of identifiers, constant indexers, and a restricted subset of functions. The path is allowed to contain qualifiers (.) to traverse sub-elements, as well as indexers ([x]) to traverse multiple-cardinality sub-elements (see the [Simple FHIRPath Profile](fhirpath.html#simple) for full details).
comment: DataRequirement.sort.path: The attribute of the sort. The specified path must be resolvable from the type of the required data. The path is allowed to contain qualifiers (.) to traverse sub-elements, as well as indexers ([x]) to traverse multiple-cardinality sub-elements. Note that the index must be an integer constant.
comment: ArtifactAssessment.content.component.path: A URI that points to what the comment is about, such as a line of text in the CQL, or a specific element in a resource.
comment: ArtifactAssessment.content.path: A URI that points to what the comment is about, such as a line of text in the CQL, or a specific element in a resource.
comment: ElementDefinition.path: The path identifies the element and is expressed as a "."-separated list of ancestor elements, beginning with the name of the resource or extension.
comment: ElementDefinition.base.path: The Path that identifies the base element - this matches the ElementDefinition.path for that element. Across FHIR, there is only one base definition of any element - that is, an element definition on a [StructureDefinition] without a StructureDefinition.base.
comment: ActivityDefinition.dynamicValue.path: The path to the element to be customized. This is the path on the resource that will hold the result of the calculation defined by the expression. The specified path SHALL be a FHIRPath resolvable on the specified target type of the ActivityDefinition, and SHALL consist only of identifiers, constant indexers, and a restricted subset of functions. The path is allowed to contain qualifiers (.) to traverse sub-elements, as well as indexers ([x]) to traverse multiple-cardinality sub-elements (see the [Simple FHIRPath Profile](fhirpath.html#simple) for full details).
comment: ElementDefinition.slicing.discriminator.path: A FHIRPath expression, using [the simple subset of FHIRPath](fhirpath.html#simple), that is used to identify the element on which discrimination is based.
comment: RequestOrchestration.action.action.dynamicValue.path: The path to the element to be customized. This is the path on the resource that will hold the result of the calculation defined by the expression. The specified path SHALL be a FHIRPath resolvable on the specified target type of the ActivityDefinition, and SHALL consist only of identifiers, constant indexers, and a restricted subset of functions. The path is allowed to contain qualifiers (.) to traverse sub-elements, as well as indexers ([x]) to traverse multiple-cardinality sub-elements (see the [Simple FHIRPath Profile](fhirpath.html#simple) for full details).
comment: TestScript.test.action.assert.path: The XPath or JSONPath expression to be evaluated against the fixture representing the response received from server.
comment: PlanDefinition.action.action.dynamicValue.path: The path to the element to be customized. This is the path on the resource that will hold the result of the calculation defined by the expression. The specified path SHALL be a FHIRPath resolvable on the specified target type of the ActivityDefinition, and SHALL consist only of identifiers, constant indexers, and a restricted subset of functions. The path is allowed to contain qualifiers (.) to traverse sub-elements, as well as indexers ([x]) to traverse multiple-cardinality sub-elements (see the [Simple FHIRPath Profile](fhirpath.html#simple) for full details).
comment: DataRequirement.codeFilter.path: The code-valued attribute of the filter. The specified path SHALL be a FHIRPath resolvable on the specified type of the DataRequirement, and SHALL consist only of identifiers, constant indexers, and .resolve(). The path is allowed to contain qualifiers (.) to traverse sub-elements, as well as indexers ([x]) to traverse multiple-cardinality sub-elements (see the [Simple FHIRPath Profile](fhirpath.html#simple) for full details). Note that the index must be an integer constant. The path must resolve to an element of type code, Coding, or CodeableConcept.
comment: TestScript.variable.path: XPath or JSONPath to evaluate against the fixture body. When variables are defined, only one of either expression, headerField or path must be specified.
comment: TestScript.setup.action.assert.path: The XPath or JSONPath expression to be evaluated against the fixture representing the response received from server.
comment: GraphDefinition.link.path: A FHIRPath expression that identifies one of FHIR References to other resources.
comment: DataRequirement.valueFilter.path: The attribute of the filter. The specified path SHALL be a FHIRPath resolvable on the specified type of the DataRequirement, and SHALL consist only of identifiers, constant indexers, and .resolve(). The path is allowed to contain qualifiers (.) to traverse sub-elements, as well as indexers ([x]) to traverse multiple-cardinality sub-elements (see the [Simple FHIRPath Profile](fhirpath.html#simple) for full details). Note that the index must be an integer constant. The path must resolve to an element of a type that is comparable to the valueFilter.value[x] element for the filter.
comment: DataRequirement.dateFilter.path: The date-valued attribute of the filter. The specified path SHALL be a FHIRPath resolvable on the specified type of the DataRequirement, and SHALL consist only of identifiers, constant indexers, and .resolve(). The path is allowed to contain qualifiers (.) to traverse sub-elements, as well as indexers ([x]) to traverse multiple-cardinality sub-elements (see the [Simple FHIRPath Profile](fhirpath.html#simple) for full details). Note that the index must be an integer constant. The path must resolve to an element of type date, dateTime, Period, Schedule, or Timing.
modifierExtensionProperty: path
title: ElementDefinition.base.path: Path that identifies the base element
title: PlanDefinition.action.action.dynamicValue.path: The path to the element to be set dynamically
title: TestScript.variable.path: XPath or JSONPath against the fixture body
title: ElementDefinition.slicing.discriminator.path: Path to element value
title: RequestOrchestration.action.action.dynamicValue.path: The path to the element to be set dynamically
title: PlanDefinition.action.dynamicValue.path: The path to the element to be set dynamically
title: ElementDefinition.path: Path of the element in the hierarchy of elements
title: RequestOrchestration.action.dynamicValue.path: The path to the element to be set dynamically
title: DataRequirement.sort.path: The name of the attribute to perform the sort
title: DataRequirement.codeFilter.path: A code-valued attribute to filter on
title: TestScript.setup.action.assert.path: XPath or JSONPath expression
title: ArtifactAssessment.content.path: What the comment is directed to
title: ActivityDefinition.dynamicValue.path: The path to the element to be set dynamically
title: TestScript.test.action.assert.path: XPath or JSONPath expression
title: ArtifactAssessment.content.component.path: What the comment is directed to
title: DataRequirement.dateFilter.path: A date-valued attribute to filter on
title: GraphDefinition.link.path: Path in the resource that contains the link
title: DataRequirement.valueFilter.path: An attribute to filter on

additive
type: ObjectProperty
comment: Specimen.processing.additive: Material used in the processing step.
comment: SpecimenDefinition.typeTested.container.additive.additive
comment: NutritionOrder.enteralFormula.additive: Indicates modular components to be provided in addition or mixed with the base formula.
comment: SpecimenDefinition.typeTested.container.additive: Substance introduced in the kind of container to preserve, maintain or enhance the specimen. Examples: Formalin, Citrate, EDTA.
modifierExtensionProperty: _additive
title: Specimen.processing.additive: Material used in the processing step
title: SpecimenDefinition.typeTested.container.additive: Additive associated with container
title: NutritionOrder.enteralFormula.additive: Components to add to the feeding

ElementDefinition
type: Class
comment: Captures constraints on each element within the resource, profile, or extension.
subclass of: BackboneType
subclass of: Restriction
  all values from: canonical
  on property: valueAlternatives
subclass of: Restriction
  max cardinality: 1
  on property: short
subclass of: Restriction
  all values from: ElementDefinitionConstraintComponent
  on property: constraint
subclass of:
  union of: Restriction
    all values from: date
    on property: minValue
  union of: Restriction
    max cardinality: 1
    on property: minValue
  union of: Restriction
    all values from: dateTime
    on property: minValue
  union of: Restriction
    max cardinality: 1
    on property: minValue
  union of: Restriction
    all values from: instant
    on property: minValue
  union of: Restriction
    max cardinality: 1
    on property: minValue
  union of: Restriction
    all values from: time
    on property: minValue
  union of: Restriction
    max cardinality: 1
    on property: minValue
  union of: Restriction
    all values from: decimal
    on property: minValue
  union of: Restriction
    max cardinality: 1
    on property: minValue
  union of: Restriction
    all values from: integer
    on property: minValue
  union of: Restriction
    max cardinality: 1
    on property: minValue
  union of: Restriction
    all values from: integer64
    on property: minValue
  union of: Restriction
    max cardinality: 1
    on property: minValue
  union of: Restriction
    all values from: positiveInt
    on property: minValue
  union of: Restriction
    max cardinality: 1
    on property: minValue
  union of: Restriction
    all values from: unsignedInt
    on property: minValue
  union of: Restriction
    max cardinality: 1
    on property: minValue
  union of: Restriction
    all values from: Quantity
    on property: minValue
  union of: Restriction
    max cardinality: 1
    on property: minValue
subclass of: Restriction
  all values from: string
  on property: path
subclass of: Restriction
  max cardinality: 1
  on property: meaningWhenMissing
subclass of: Restriction
  all values from: ElementDefinitionBaseComponent
  on property: base
subclass of: Restriction
  all values from: markdown
  on property: definition
subclass of: Restriction
  max cardinality: 1
  on property: definition
subclass of: Restriction
  all values from: markdown
  on property: comment
subclass of: Restriction
  cardinality: 1
  on property: path
subclass of: Restriction
  max cardinality: 1
  on property: requirements
subclass of: Restriction
  all values from: ElementDefinitionSlicingComponent
  on property: slicing
subclass of: Restriction
  max cardinality: 1
  on property: base
subclass of: Restriction
  max cardinality: 1
  on property: fixed
subclass of: Restriction
  all values from: boolean
  on property: mustHaveValue
subclass of: Restriction
  max cardinality: 1
  on property: pattern
subclass of: Restriction
  all values from: string
  on property: orderMeaning
subclass of: Restriction
  max cardinality: 1
  on property: comment
subclass of: Restriction
  max cardinality: 1
  on property: contentReference
subclass of: Restriction
  all values from: code
  on property: representation
subclass of: Restriction
  all values from: boolean
  on property: isSummary
subclass of: Restriction
  all values from: string
  on property: label
subclass of: Restriction
  max cardinality: 1
  on property: defaultValue
subclass of: Restriction
  all values from: string
  on property: sliceName
subclass of: Restriction
  max cardinality: 1
  on property: mustSupport
subclass of: Restriction
  all values from: ElementDefinitionMappingComponent
  on property: mapping
subclass of: Restriction
  max cardinality: 1
  on property: isSummary
subclass of: Restriction
  max cardinality: 1
  on property: slicing
subclass of: Restriction
  max cardinality: 1
  on property: binding
subclass of: Restriction
  max cardinality: 1
  on property: sliceIsConstraining
subclass of: Restriction
  all values from: Coding
  on property: code
subclass of: Restriction
  max cardinality: 1
  on property: max
subclass of: Restriction
  max cardinality: 1
  on property: isModifierReason
subclass of:
  union of: Restriction
    all values from: date
    on property: maxValue
  union of: Restriction
    max cardinality: 1
    on property: maxValue
  union of: Restriction
    all values from: dateTime
    on property: maxValue
  union of: Restriction
    max cardinality: 1
    on property: maxValue
  union of: Restriction
    all values from: instant
    on property: maxValue
  union of: Restriction
    max cardinality: 1
    on property: maxValue
  union of: Restriction
    all values from: time
    on property: maxValue
  union of: Restriction
    max cardinality: 1
    on property: maxValue
  union of: Restriction
    all values from: decimal
    on property: maxValue
  union of: Restriction
    max cardinality: 1
    on property: maxValue
  union of: Restriction
    all values from: integer
    on property: maxValue
  union of: Restriction
    max cardinality: 1
    on property: maxValue
  union of: Restriction
    all values from: integer64
    on property: maxValue
modifierExtensionClass: ElementDefinition
title: Definition of an element in a resource or extension

fundingSource
type: ObjectProperty
comment: Immunization.fundingSource: Indicates the source of the vaccine actually administered. This may be different than the patient eligibility (e.g. the patient may be eligible for a publically purchased vaccine but due to inventory issues, vaccine purchased with private funds was actually administered).
modifierExtensionProperty: fundingSource
title: Immunization.fundingSource: Funding source for the vaccine

instantiatesCanonical
type: ObjectProperty
comment: GenomicStudy.instantiatesCanonical: The defined protocol that describes the study.
comment: GenomicStudy.analysis.instantiatesCanonical: The defined protocol that describes the analysis.
comment: Contract.instantiatesCanonical: The URL pointing to a FHIR-defined Contract Definition that is adhered to in whole or part by this Contract.
comment: Communication.instantiatesCanonical: The URL pointing to a FHIR-defined protocol, guideline, orderset or other definition that is adhered to in whole or in part by this Communication.
comment: FamilyMemberHistory.instantiatesCanonical: The URL pointing to a FHIR-defined protocol, guideline, orderset or other definition that is adhered to in whole or in part by this FamilyMemberHistory.
comment: CarePlan.instantiatesCanonical: The URL pointing to a FHIR-defined protocol, guideline, questionnaire or other definition that is adhered to in whole or in part by this CarePlan.
comment: ServiceRequest.instantiatesCanonical: The URL pointing to a FHIR-defined protocol, guideline, orderset or other definition that is adhered to in whole or in part by this ServiceRequest.
comment: DeviceRequest.instantiatesCanonical: The URL pointing to a FHIR-defined protocol, guideline, orderset or other definition that is adhered to in whole or in part by this DeviceRequest.
comment: Procedure.instantiatesCanonical: The URL pointing to a FHIR-defined protocol, guideline, order set or other definition that is adhered to in whole or in part by this Procedure.
comment: NutritionIntake.instantiatesCanonical: Instantiates FHIR protocol or definition.
comment: RequestOrchestration.instantiatesCanonical: A canonical URL referencing a FHIR-defined protocol, guideline, orderset or other definition that is adhered to in whole or in part by this request.
comment: Transport.instantiatesCanonical: The URL pointing to a *FHIR*-defined protocol, guideline, orderset or other definition that is adhered to in whole or in part by this Transport.
comment: NutritionOrder.instantiatesCanonical: The URL pointing to a FHIR-defined protocol, guideline, orderset or other definition that is adhered to in whole or in part by this NutritionOrder.
comment: Task.instantiatesCanonical: The URL pointing to a *FHIR*-defined protocol, guideline, orderset or other definition that is adhered to in whole or in part by this Task.
modifierExtensionProperty: _instantiatesCanonical
title: RequestOrchestration.instantiatesCanonical: Instantiates FHIR protocol or definition
title: Procedure.instantiatesCanonical: Instantiates FHIR protocol or definition
title: DeviceRequest.instantiatesCanonical: Instantiates FHIR protocol or definition
title: NutritionIntake.instantiatesCanonical: Instantiates FHIR protocol or definition
title: CarePlan.instantiatesCanonical: Instantiates FHIR protocol or definition
title: GenomicStudy.instantiatesCanonical: The defined protocol that describes the study
title: Contract.instantiatesCanonical: Source Contract Definition
title: NutritionOrder.instantiatesCanonical: Instantiates FHIR protocol or definition
title: FamilyMemberHistory.instantiatesCanonical: Instantiates FHIR protocol or definition
title: Task.instantiatesCanonical: Formal definition of task
title: GenomicStudy.analysis.instantiatesCanonical: The defined protocol that describes the analysis
title: ServiceRequest.instantiatesCanonical: Instantiates FHIR protocol or definition
title: Communication.instantiatesCanonical: Instantiates FHIR protocol or definition
title: Transport.instantiatesCanonical: Formal definition of transport

family
type: ObjectProperty
comment: SubstanceSourceMaterial.organism.family: The family of an organism shall be specified.
comment: HumanName.family: The part of a name that links to the genealogy. In some cultures (e.g. Eritrea) the family name of a son is the first name of his father.
modifierExtensionProperty: family
title: SubstanceSourceMaterial.organism.family: The family of an organism shall be specified
title: HumanName.family: Family name (often called 'Surname')

NutritionIntake
type: Class
comment: A record of food or fluid that is being consumed by a patient. A NutritionIntake may indicate that the patient may be consuming the food or fluid now or has consumed the food or fluid in the past. The source of this information can be the patient, significant other (such as a family member or spouse), or a clinician. A common scenario where this information is captured is during the history taking process during a patient visit or stay or through an app that tracks food or fluids consumed. The consumption information may come from sources such as the patient's memory, from a nutrition label, or from a clinician documenting observed intake.
subclass of: clinical.careprovision
subclass of: DomainResource
subclass of: Restriction
  cardinality: 1
  on property: subject
subclass of: Restriction
  all values from: NutritionIntakeConsumedItemComponent
  on property: consumedItem
subclass of: Restriction
  all values from: Reference
  on property: location
subclass of: Restriction
  min cardinality: 1
  on property: consumedItem
subclass of: Restriction
  all values from: Reference
  on property: basedOn
subclass of:
  union of: Restriction
    all values from: boolean
    on property: reported
  union of: Restriction
    max cardinality: 1
    on property: reported
  union of: Restriction
    all values from: Reference
    on property: reported
  union of: Restriction
    max cardinality: 1
    on property: reported
subclass of: Restriction
  all values from: Annotation
  on property: note
subclass of: Restriction
  all values from: code
  on property: status
subclass of: Restriction
  all values from: CodeableConcept
  on property: code
subclass of:
  union of: Restriction
    all values from: dateTime
    on property: occurrence
  union of: Restriction
    max cardinality: 1
    on property: occurrence
  union of: Restriction
    all values from: Period
    on property: occurrence
  union of: Restriction
    max cardinality: 1
    on property: occurrence
subclass of: Restriction
  all values from: Reference
  on property: subject
subclass of: Restriction
  max cardinality: 1
  on property: recorded
subclass of: Restriction
  all values from: Identifier
  on property: identifier
subclass of: Restriction
  all values from: CodeableReference
  on property: reason
subclass of: Restriction
  max cardinality: 1
  on property: code
subclass of: Restriction
  all values from: NutritionIntakePerformerComponent
  on property: performer
subclass of: Restriction
  all values from: CodeableConcept
  on property: statusReason
subclass of: Restriction
  all values from: Reference
  on property: encounter
subclass of: Restriction
  all values from: uri
  on property: instantiatesUri
subclass of: Restriction
  all values from: NutritionIntakeIngredientLabelComponent
  on property: ingredientLabel
subclass of: Restriction
  max cardinality: 1
  on property: encounter
subclass of: Restriction
  max cardinality: 1
  on property: location
subclass of: Restriction
  all values from: Reference
  on property: derivedFrom
subclass of: Restriction
  all values from: canonical
  on property: instantiatesCanonical
subclass of: Restriction
  all values from: Reference
  on property: partOf
subclass of: Restriction
  all values from: dateTime
  on property: recorded
subclass of: Restriction
  cardinality: 1
  on property: status
modifierExtensionClass: NutritionIntake

EvidenceReport
type: Class
comment: The EvidenceReport Resource is a specialized container for a collection of resources and codeable concepts, adapted to support compositions of Evidence, EvidenceVariable, and Citation resources and related concepts.
subclass of: MetadataResource
subclass of: clinical.general
subclass of: Restriction
  all values from: Annotation
  on property: note
subclass of: Restriction
  all values from: ContactDetail
  on property: author
subclass of: Restriction
  all values from: uri
  on property: url
subclass of: Restriction
  all values from: ContactDetail
  on property: reviewer
subclass of: Restriction
  all values from: string
  on property: publisher
subclass of: Restriction
  all values from: code
  on property: status
subclass of: Restriction
  all values from: UsageContext
  on property: useContext
subclass of: Restriction
  all values from: Section
  on property: section
subclass of: Restriction
  all values from: ContactDetail
  on property: endorser
subclass of: Restriction
  max cardinality: 1
  on property: type
subclass of: Restriction
  all values from: EvidenceReportSubjectComponent
  on property: subject
subclass of: Restriction
  all values from: Identifier
  on property: identifier
subclass of: Restriction
  max cardinality: 1
  on property: publisher
subclass of: Restriction
  all values from: CodeableConcept
  on property: type
subclass of: Restriction
  all values from: ContactDetail
  on property: contact
subclass of: Restriction
  all values from: ContactDetail
  on property: editor
subclass of:
  union of: Restriction
    all values from: Reference
    on property: citeAs
  union of: Restriction
    max cardinality: 1
    on property: citeAs
  union of: Restriction
    all values from: markdown
    on property: citeAs
  union of: Restriction
    max cardinality: 1
    on property: citeAs
subclass of: Restriction
  cardinality: 1
  on property: subject
subclass of: Restriction
  all values from: Identifier
  on property: relatedIdentifier
subclass of: Restriction
  cardinality: 1
  on property: status
subclass of: Restriction
  max cardinality: 1
  on property: url
subclass of: Restriction
  all values from: RelatedArtifact
  on property: relatedArtifact
subclass of: Restriction
  all values from: EvidenceReportRelatesToComponent
  on property: relatesTo

billablePeriod
type: ObjectProperty
comment: ExplanationOfBenefit.billablePeriod: The period for which charges are being submitted.
comment: Claim.billablePeriod: The period for which charges are being submitted.
sub property of: when.done
modifierExtensionProperty: _billablePeriod
title: ExplanationOfBenefit.billablePeriod: Relevant time frame for the claim
title: Claim.billablePeriod: Relevant time frame for the claim

_otherTherapy
type: ObjectProperty
comment: (Modified) ClinicalUseDefinition.indication.otherTherapy
comment: (Modified) ClinicalUseDefinition.contraindication.otherTherapy

_dateOfService
type: ObjectProperty
comment: (Modified) Account.procedure.dateOfService

_benefitBalance
type: ObjectProperty
comment: (Modified) ExplanationOfBenefit.benefitBalance

_information
type: ObjectProperty
comment: (Modified) CoverageEligibilityRequest.supportingInfo.information

_CareTeam
type: Class
comment: (Modified) CareTeam
subclass of: DomainResource

_aggregateMethod
type: ObjectProperty
comment: (Modified) Measure.group.population.aggregateMethod

generatedBy
type: ObjectProperty
comment: GenomicStudy.analysis.input.generatedBy
modifierExtensionProperty: generatedBy

_tag
type: ObjectProperty
comment: (Modified) Meta.tag

asserter
type: ObjectProperty
comment: Permission.asserter: The person or entity that asserts the permission.
modifierExtensionProperty: _asserter
title: Permission.asserter: The person or entity that asserts the permission

_revInclude
type: ObjectProperty
comment: (Modified) SubscriptionTopic.notificationShape.revInclude

onset
type: ObjectProperty
comment: FamilyMemberHistory.condition.onset
comment: Condition.onset
comment: AllergyIntolerance.reaction.onset: Record of the date and/or time of the onset of the Reaction.
comment: AllergyIntolerance.onset
modifierExtensionProperty: onset
title: AllergyIntolerance.reaction.onset: Date(/time) when manifestations showed

criticalCodedValueSet
type: ObjectProperty
comment: ObservationDefinition.component.qualifiedValue.criticalCodedValueSet: The set of critical coded results for qualitative observations that match the criteria of this set of qualified values.
comment: ObservationDefinition.qualifiedValue.criticalCodedValueSet: The set of critical coded results for qualitative observations that match the criteria of this set of qualified values.
modifierExtensionProperty: _criticalCodedValueSet
title: ObservationDefinition.component.qualifiedValue.criticalCodedValueSet: Value set of critical coded values as part of this set of qualified values
title: ObservationDefinition.qualifiedValue.criticalCodedValueSet: Value set of critical coded values as part of this set of qualified values

_mode
type: ObjectProperty
comment: (Modified) Device.mode
comment: (Modified) StructureMap.group.input.mode
comment: (Modified) Bundle.entry.search.mode
comment: (Modified) ConceptMap.group.unmapped.mode
comment: (Modified) EvidenceReport.section.mode
comment: (Modified) Composition.attester.mode
comment: (Modified) Location.mode
comment: (Modified) CapabilityStatement.rest.mode
comment: (Modified) CapabilityStatement.document.mode
comment: (Modified) EvidenceReport.section.section.mode
comment: (Modified) CapabilityStatement.messaging.supportedMessage.mode
comment: (Modified) StructureMap.structure.mode
comment: (Modified) List.mode
comment: (Modified) DocumentReference.attester.mode

anchor
type: ObjectProperty
comment: ImplementationGuide.manifest.page.anchor: The name of an anchor available on the page.
modifierExtensionProperty: anchor
title: ImplementationGuide.manifest.page.anchor: Anchor available on the page

_substitution
type: ObjectProperty
comment: (Modified) MedicationRequest.substitution
comment: (Modified) MedicationKnowledge.regulatory.substitution
comment: (Modified) MedicationDispense.substitution

_consent
type: ObjectProperty
comment: (Modified) ResearchSubject.consent

_candidate
type: ObjectProperty
comment: (Modified) EnrollmentRequest.candidate

_concept
type: ObjectProperty
comment: (Modified) ValueSet.compose.exclude.concept
comment: (Modified) ValueSet.compose.include.concept
comment: (Modified) CodeSystem.concept.concept
comment: (Modified) CodeSystem.concept.concept.concept
comment: (Modified) CodeSystem.concept
comment: (Modified) CodeableReference.concept

MeasureReportGroupStratifierStratumComponentComponent
type: Class
comment: MeasureReportGroupComponent.MeasureReportGroupStratifierComponent.StratifierGroup.MeasureReportGroupStratifierStratumComponentComponent: A stratifier component value.
subclass of: BackboneElement
subclass of:
  union of: Restriction
    all values from: CodeableConcept
    on property: value
  union of: Restriction
    cardinality: 1
    on property: value
  union of: Restriction
    all values from: boolean
    on property: value
  union of: Restriction
    cardinality: 1
    on property: value
  union of: Restriction
    all values from: Quantity
    on property: value
  union of: Restriction
    cardinality: 1
    on property: value
  union of: Restriction
    all values from: Range
    on property: value
  union of: Restriction
    cardinality: 1
    on property: value
  union of: Restriction
    all values from: Reference
    on property: value
  union of: Restriction
    cardinality: 1
    on property: value
subclass of: Restriction
  cardinality: 1
  on property: code
subclass of: Restriction
  all values from: CodeableConcept
  on property: code
subclass of: Restriction
  max cardinality: 1
  on property: linkId
subclass of: Restriction
  all values from: string
  on property: linkId

ifNoneExist
type: ObjectProperty
comment: Bundle.entry.request.ifNoneExist: Instruct the server not to perform the create if a specified resource already exists. For further information, see the API documentation for ["Conditional Create"](http.html#ccreate). This is just the query portion of the URL - what follows the "?" (not including the "?").
modifierExtensionProperty: ifNoneExist
title: Bundle.entry.request.ifNoneExist: For conditional creates

GraphDefinitionNodeComponent
type: Class
comment: GraphDefinitionNodeComponent: Potential target for the link.
subclass of: BackboneElement
subclass of: Restriction
  cardinality: 1
  on property: nodeId
subclass of: Restriction
  max cardinality: 1
  on property: description
subclass of: Restriction
  all values from: canonical
  on property: profile
subclass of: Restriction
  max cardinality: 1
  on property: profile
subclass of: Restriction
  cardinality: 1
  on property: type
subclass of: Restriction
  all values from: string
  on property: description
subclass of: Restriction
  all values from: code
  on property: type
subclass of: Restriction
  all values from: id
  on property: nodeId

_answer
type: ObjectProperty
comment: (Modified) Contract.term.group.asset.answer
comment: (Modified) Questionnaire.item.item.enableWhen.answer
comment: (Modified) Contract.term.group.offer.answer
comment: (Modified) Contract.term.asset.answer
comment: (Modified) Questionnaire.item.enableWhen.answer
comment: (Modified) QuestionnaireResponse.item.item.answer
comment: (Modified) QuestionnaireResponse.item.answer
comment: (Modified) Contract.term.offer.answer
comment: (Modified) QuestionnaireResponse.item.answer.item.answer

_schedule
type: ObjectProperty
comment: (Modified) Slot.schedule
comment: (Modified) NutritionOrder.enteralFormula.administration.schedule
comment: (Modified) NutritionOrder.supplement.schedule
comment: (Modified) NutritionOrder.oralDiet.schedule
comment: (Modified) NutritionIntake.consumedItem.schedule
comment: (Modified) MedicationKnowledge.regulatory.schedule

administrationTreatment
type: ObjectProperty
comment: MedicationKnowledge.indicationGuideline.dosingGuideline.administrationTreatment: The type of the treatment that the guideline applies to, for example, long term therapy, first line treatment, etc.
modifierExtensionProperty: administrationTreatment
title: MedicationKnowledge.indicationGuideline.dosingGuideline.administrationTreatment: Type of treatment the guideline applies to

Narrative.div
type: DatatypeProperty

_baseFormulaProductName
type: ObjectProperty
comment: (Modified) NutritionOrder.enteralFormula.baseFormulaProductName

PermissionRuleDataResourceComponent
type: Class
comment: Permission.Rule.PermissionRuleDataComponent.PermissionRuleDataResourceComponent: Explicit FHIR Resource references.
subclass of: BackboneElement
subclass of: Restriction
  cardinality: 1
  on property: reference
subclass of: Restriction
  all values from: Reference
  on property: reference
subclass of: Restriction
  cardinality: 1
  on property: meaning
subclass of: Restriction
  all values from: code
  on property: meaning

_gestationalAge
type: ObjectProperty
comment: (Modified) ObservationDefinition.component.qualifiedValue.gestationalAge
comment: (Modified) ObservationDefinition.qualifiedValue.gestationalAge

carrierAIDC
type: ObjectProperty
comment: Device.udiCarrier.carrierAIDC: The full UDI carrier of the Automatic Identification and Data Capture (AIDC) technology representation of the barcode string as printed on the packaging of the device - e.g., a barcode or RFID. Because of limitations on character sets in XML and the need to round-trip JSON data through XML, AIDC Formats *SHALL* be base64 encoded.
modifierExtensionProperty: carrierAIDC
title: Device.udiCarrier.carrierAIDC: UDI Machine Readable Barcode String

_capability
type: ObjectProperty
comment: (Modified) TestScript.metadata.capability

usageStatus
type: ObjectProperty
comment: DeviceUsage.usageStatus: The status of the device usage, for example always, sometimes, never. This is not the same as the status of the statement.
modifierExtensionProperty: _usageStatus
title: DeviceUsage.usageStatus: The status of the device usage, for example always, sometimes, never. This is not the same as the status of the statement

_knownAllergen
type: ObjectProperty
comment: (Modified) NutritionProduct.knownAllergen

storageTempRequirements
type: ObjectProperty
comment: BiologicallyDerivedProduct.storageTempRequirements: The temperature requirements for storage of the biologically-derived product.
modifierExtensionProperty: storageTempRequirements
title: BiologicallyDerivedProduct.storageTempRequirements: Product storage temperature requirements

definitionReference
type: ObjectProperty
comment: EvidenceVariable.characteristic.definitionByCombination.characteristic.definitionReference: Defines the characteristic using a Reference.
comment: EvidenceVariable.characteristic.definitionReference: Defines the characteristic using a Reference.
modifierExtensionProperty: definitionReference
title: EvidenceVariable.characteristic.definitionByCombination.characteristic.definitionReference: Defines the characteristic (without using type and value) by a Reference
title: EvidenceVariable.characteristic.definitionReference: Defines the characteristic (without using type and value) by a Reference

experimental
type: ObjectProperty
comment: SubscriptionTopic.experimental: A flag to indicate that this TopSubscriptionTopicic is authored for testing purposes (or education/evaluation/marketing), and is not intended to be used for genuine usage.
comment: TerminologyCapabilities.experimental: A Boolean value to indicate that this terminology capabilities is authored for testing purposes (or education/evaluation/marketing) and is not intended to be used for genuine usage.
comment: StructureMap.experimental: A Boolean value to indicate that this structure map is authored for testing purposes (or education/evaluation/marketing) and is not intended to be used for genuine usage.
comment: Evidence.experimental: A Boolean value to indicate that this resource is authored for testing purposes (or education/evaluation/marketing) and is not intended to be used for genuine usage.
comment: ExampleScenario.experimental: A Boolean value to indicate that this example scenario is authored for testing purposes (or education/evaluation/marketing) and is not intended to be used for genuine usage.
comment: CapabilityStatement.experimental: A Boolean value to indicate that this capability statement is authored for testing purposes (or education/evaluation/marketing) and is not intended to be used for genuine usage.
comment: EventDefinition.experimental: A Boolean value to indicate that this event definition is authored for testing purposes (or education/evaluation/marketing) and is not intended to be used for genuine usage.
comment: NamingSystem.experimental: A Boolean value to indicate that this naming system is authored for testing purposes (or education/evaluation/marketing) and is not intended to be used for genuine usage.
comment: Citation.experimental: A Boolean value to indicate that this citation record is authored for testing purposes (or education/evaluation/marketing) and is not intended to be used for genuine usage.
comment: GraphDefinition.experimental: A Boolean value to indicate that this graph definition is authored for testing purposes (or education/evaluation/marketing) and is not intended to be used for genuine usage.
comment: StructureDefinition.experimental: A Boolean value to indicate that this structure definition is authored for testing purposes (or education/evaluation/marketing) and is not intended to be used for genuine usage.
comment: ConditionDefinition.experimental: A Boolean value to indicate that this condition definition is authored for testing purposes (or education/evaluation/marketing) and is not intended to be used for genuine usage.
comment: SearchParameter.experimental: A Boolean value to indicate that this search parameter is authored for testing purposes (or education/evaluation/marketing) and is not intended to be used for genuine usage.
comment: TestPlan.experimental: A Boolean value to indicate that this test plan is authored for testing purposes (or education/evaluation/marketing) and is not intended to be used for genuine usage.
comment: MessageDefinition.experimental: A Boolean value to indicate that this message definition is authored for testing purposes (or education/evaluation/marketing) and is not intended to be used for genuine usage.
comment: CompartmentDefinition.experimental: A Boolean value to indicate that this compartment definition is authored for testing purposes (or education/evaluation/marketing) and is not intended to be used for genuine usage.
comment: ImplementationGuide.experimental: A Boolean value to indicate that this implementation guide is authored for testing purposes (or education/evaluation/marketing) and is not intended to be used for genuine usage.
comment: ActivityDefinition.experimental: A Boolean value to indicate that this activity definition is authored for testing purposes (or education/evaluation/marketing) and is not intended to be used for genuine usage.
comment: ChargeItemDefinition.experimental: A Boolean value to indicate that this charge item definition is authored for testing purposes (or education/evaluation/marketing) and is not intended to be used for genuine usage.
comment: ObservationDefinition.experimental: A flag to indicate that this ObservationDefinition is authored for testing purposes (or education/evaluation/marketing), and is not intended to be used for genuine usage.
comment: ValueSet.experimental: A Boolean value to indicate that this value set is authored for testing purposes (or education/evaluation/marketing) and is not intended to be used for genuine usage.
comment: OperationDefinition.experimental: A Boolean value to indicate that this operation definition is authored for testing purposes (or education/evaluation/marketing) and is not intended for genuine usage.
comment: CodeSystem.experimental: A Boolean value to indicate that this code system is authored for testing purposes (or education/evaluation/marketing) and is not intended to be used for genuine usage.
comment: CanonicalResource.experimental: A Boolean value to indicate that this {{title}} is authored for testing purposes (or education/evaluation/marketing) and is not intended for genuine usage.
comment: EvidenceVariable.experimental: A Boolean value to indicate that this resource is authored for testing purposes (or education/evaluation/marketing) and is not intended to be used for genuine usage.
comment: PlanDefinition.experimental: A Boolean value to indicate that this plan definition is authored for testing purposes (or education/evaluation/marketing) and is not intended to be used for genuine usage.
comment: SpecimenDefinition.experimental: A flag to indicate that this SpecimenDefinition is not authored for genuine usage.
comment: Measure.experimental: A Boolean value to indicate that this measure is authored for testing purposes (or education/evaluation/marketing) and is not intended to be used for genuine usage.
comment: Questionnaire.experimental: A Boolean value to indicate that this questionnaire is authored for testing purposes (or education/evaluation/marketing) and is not intended for genuine usage.
comment: Library.experimental: A Boolean value to indicate that this library is authored for testing purposes (or education/evaluation/marketing) and is not intended to be used for genuine usage.
comment: Requirements.experimental: A Boolean value to indicate that this Requirements is authored for testing purposes (or education/evaluation/marketing) and is not intended to be used for genuine usage.
comment: ActorDefinition.experimental: A Boolean value to indicate that this actor definition is authored for testing purposes (or education/evaluation/marketing) and is not intended to be used for genuine usage.
comment: ConceptMap.experimental: A Boolean value to indicate that this concept map is authored for testing purposes (or education/evaluation/marketing) and is not intended to be used for genuine usage.
comment: TestScript.experimental: A Boolean value to indicate that this test script is authored for testing purposes (or education/evaluation/marketing) and is not intended to be used for genuine usage.
sub property of: class
modifierExtensionProperty: experimental
title: Measure.experimental: For testing purposes, not real usage
title: NamingSystem.experimental: For testing purposes, not real usage
title: ConditionDefinition.experimental: For testing purposes, not real usage
title: ActivityDefinition.experimental: For testing purposes, not real usage
title: TestScript.experimental: For testing purposes, not real usage
title: ConceptMap.experimental: For testing purposes, not real usage
title: PlanDefinition.experimental: For testing purposes, not real usage
title: OperationDefinition.experimental: For testing purposes, not real usage
title: Citation.experimental: For testing purposes, not real usage
title: CompartmentDefinition.experimental: For testing purposes, not real usage
title: CapabilityStatement.experimental: For testing purposes, not real usage
title: EvidenceVariable.experimental: For testing purposes, not real usage
title: SpecimenDefinition.experimental: If this SpecimenDefinition is not for real usage
title: Questionnaire.experimental: For testing purposes, not real usage
title: SubscriptionTopic.experimental: If for testing purposes, not real usage
title: ImplementationGuide.experimental: For testing purposes, not real usage
title: Requirements.experimental: For testing purposes, not real usage
title: StructureMap.experimental: For testing purposes, not real usage
title: ValueSet.experimental: For testing purposes, not real usage
title: ObservationDefinition.experimental: If for testing purposes, not real usage
title: GraphDefinition.experimental: For testing purposes, not real usage
title: EventDefinition.experimental: For testing purposes, not real usage
title: Library.experimental: For testing purposes, not real usage
title: TerminologyCapabilities.experimental: For testing purposes, not real usage
title: SearchParameter.experimental: For testing purposes, not real usage
title: ChargeItemDefinition.experimental: For testing purposes, not real usage
title: TestPlan.experimental: For testing purposes, not real usage
title: ExampleScenario.experimental: For testing purposes, not real usage
title: MessageDefinition.experimental: For testing purposes, not real usage
title: Evidence.experimental: For testing purposes, not real usage
title: StructureDefinition.experimental: For testing purposes, not real usage
title: CodeSystem.experimental: For testing purposes, not real usage
title: CanonicalResource.experimental: For testing purposes, not real usage
title: ActorDefinition.experimental: For testing purposes, not real usage

_numberOfParticipants
type: ObjectProperty
comment: (Modified) Evidence.statistic.sampleSize.numberOfParticipants

_repeat
type: ObjectProperty
comment: (Modified) SubstancePolymer.repeat
comment: (Modified) Timing.repeat

displayName
type: ObjectProperty
comment: Device.displayName: The name used to display by default when the device is referenced. Based on intent of use by the resource creator, this may reflect one of the names in Device.name, or may be another simple name.
modifierExtensionProperty: displayName
title: Device.displayName: The name used to display by default when the device is referenced

replaces
type: ObjectProperty
comment: ServiceRequest.replaces: The request takes the place of the referenced completed or terminated request(s).
comment: CarePlan.replaces: Completed or terminated care plan whose function is taken by this new care plan.
comment: DeviceRequest.replaces: The request takes the place of the referenced completed or terminated request(s).
comment: Appointment.replaces: Appointment replaced by this Appointment in cases where there is a cancellation, the details of the cancellation can be found in the cancellationReason property (on the referenced resource).
comment: RequestOrchestration.replaces: Completed or terminated request(s) whose function is taken by this new request.
comment: MessageDefinition.replaces: A MessageDefinition that is superseded by this definition.
comment: CommunicationRequest.replaces: Completed or terminated request(s) whose function is taken by this new request.
comment: ChargeItemDefinition.replaces: As new versions of a protocol or guideline are defined, allows identification of what versions are replaced by a new instance.
sub property of: context
modifierExtensionProperty: _replaces
title: ChargeItemDefinition.replaces: Completed or terminated request(s) whose function is taken by this new request
title: Appointment.replaces: Appointment replaced by this Appointment
title: DeviceRequest.replaces: What request replaces
title: MessageDefinition.replaces: Takes the place of
title: ServiceRequest.replaces: What request replaces
title: RequestOrchestration.replaces: Request(s) replaced by this request
title: CarePlan.replaces: CarePlan replaced by this CarePlan
title: CommunicationRequest.replaces: Request(s) replaced by this request

_distanceFromLandmark
type: ObjectProperty
comment: (Modified) BodyStructure.excludedStructure.bodyLandmarkOrientation.distanceFromLandmark
comment: (Modified) BodyStructure.includedStructure.bodyLandmarkOrientation.distanceFromLandmark

_frequency
type: ObjectProperty
comment: (Modified) VerificationResult.frequency
comment: (Modified) Timing.repeat.frequency

shortDoco
type: ObjectProperty
comment: ElementDefinition.binding.additional.shortDoco: Concise documentation - for summary tables.
modifierExtensionProperty: shortDoco
title: ElementDefinition.binding.additional.shortDoco: Concise documentation - for summary tables

ImagingSelection
type: Class
comment: A selection of DICOM SOP instances and/or frames within a single Study and Series. This might include additional specifics such as an image region, an Observation UID or a Segmentation Number, allowing linkage to an Observation Resource or transferring this information along with the ImagingStudy Resource.
subclass of: clinical.diagnostics
subclass of: DomainResource
subclass of: Restriction
  all values from: Reference
  on property: subject
subclass of: Restriction
  all values from: instant
  on property: issued
subclass of: Restriction
  all values from: id
  on property: studyUid
subclass of: Restriction
  all values from: ImagingSelectionPerformerComponent
  on property: performer
subclass of: Restriction
  all values from: Reference
  on property: endpoint
subclass of: Restriction
  all values from: Reference
  on property: derivedFrom
subclass of: Restriction
  all values from: unsignedInt
  on property: seriesNumber
subclass of: Restriction
  all values from: Identifier
  on property: identifier
subclass of: Restriction
  max cardinality: 1
  on property: frameOfReferenceUid
subclass of: Restriction
  all values from: id
  on property: frameOfReferenceUid
subclass of: Restriction
  all values from: id
  on property: seriesUid
subclass of: Restriction
  max cardinality: 1
  on property: seriesUid
subclass of: Restriction
  max cardinality: 1
  on property: studyUid
subclass of: Restriction
  max cardinality: 1
  on property: subject
subclass of: Restriction
  all values from: CodeableConcept
  on property: code
subclass of: Restriction
  cardinality: 1
  on property: status
subclass of: Restriction
  all values from: CodeableReference
  on property: bodySite
subclass of: Restriction
  all values from: Reference
  on property: basedOn
subclass of: Restriction
  cardinality: 1
  on property: code
subclass of: Restriction
  max cardinality: 1
  on property: issued
subclass of: Restriction
  max cardinality: 1
  on property: bodySite
subclass of: Restriction
  all values from: code
  on property: status
subclass of: Restriction
  all values from: Reference
  on property: focus
subclass of: Restriction
  max cardinality: 1
  on property: seriesNumber
subclass of: Restriction
  all values from: CodeableConcept
  on property: category
subclass of: Restriction
  all values from: ImagingSelectionInstanceComponent
  on property: instance
modifierExtensionClass: ImagingSelection

modality
type: ObjectProperty
comment: ImagingStudy.modality: A list of all the distinct values of series.modality. This may include both acquisition and non-acquisition modalities.
comment: ImagingStudy.series.modality: The distinct modality for this series. This may include both acquisition and non-acquisition modalities.
comment: DocumentReference.modality: Imaging modality used. This may include both acquisition and non-acquisition modalities.
sub property of: class
modifierExtensionProperty: _modality
title: ImagingStudy.modality: All of the distinct values for series' modalities
title: ImagingStudy.series.modality: The modality used for this series
title: DocumentReference.modality: Imaging modality used

_targetId
type: ObjectProperty
comment: (Modified) TestScript.test.action.operation.targetId
comment: (Modified) PlanDefinition.action.relatedAction.targetId
comment: (Modified) TestScript.teardown.action.operation.targetId
comment: (Modified) PlanDefinition.action.action.relatedAction.targetId
comment: (Modified) TestScript.setup.action.operation.targetId
comment: (Modified) RequestOrchestration.action.action.relatedAction.targetId
comment: (Modified) GraphDefinition.link.targetId
comment: (Modified) RequestOrchestration.action.relatedAction.targetId

_amount
type: ObjectProperty
comment: (Modified) ExplanationOfBenefit.adjudication.amount
comment: (Modified) ClaimResponse.total.amount
comment: (Modified) MonetaryComponent.amount
comment: (Modified) ClaimResponse.addItem.adjudication.amount
comment: (Modified) ExplanationOfBenefit.item.adjudication.amount
comment: (Modified) ExplanationOfBenefit.addItem.detail.subDetail.adjudication.amount
comment: (Modified) ClaimResponse.item.detail.subDetail.adjudication.amount
comment: (Modified) NutritionIntake.consumedItem.amount
comment: (Modified) PaymentNotice.amount
comment: (Modified) ExplanationOfBenefit.item.detail.adjudication.amount
comment: (Modified) ClaimResponse.addItem.detail.adjudication.amount
comment: (Modified) PaymentReconciliation.amount
comment: (Modified) SubstancePolymer.repeat.repeatUnit.amount
comment: (Modified) ExplanationOfBenefit.item.detail.subDetail.adjudication.amount
comment: (Modified) SubstanceDefinition.molecularWeight.amount
comment: (Modified) NutritionIntake.ingredientLabel.amount
comment: (Modified) ManufacturedItemDefinition.component.constituent.amount
comment: (Modified) SubstanceReferenceInformation.target.amount
comment: (Modified) NutritionOrder.oralDiet.nutrient.amount
comment: (Modified) ClaimResponse.item.detail.adjudication.amount
comment: (Modified) SubstanceDefinition.structure.molecularWeight.amount
comment: (Modified) PackagedProductDefinition.packaging.packaging.containedItem.amount
comment: (Modified) SubstanceDefinition.relationship.amount
comment: (Modified) ManufacturedItemDefinition.component.component.constituent.amount
comment: (Modified) VisionPrescription.lensSpecification.prism.amount
comment: (Modified) ExplanationOfBenefit.addItem.adjudication.amount
comment: (Modified) ClaimResponse.adjudication.amount
comment: (Modified) ManufacturedItemDefinition.component.amount
comment: (Modified) NutritionProduct.ingredient.amount
comment: (Modified) ClaimResponse.item.adjudication.amount
comment: (Modified) SubstancePolymer.monomerSet.startingMaterial.amount
comment: (Modified) PaymentReconciliation.allocation.amount
comment: (Modified) ExplanationOfBenefit.total.amount
comment: (Modified) ManufacturedItemDefinition.component.component.amount
comment: (Modified) ClaimResponse.payment.amount
comment: (Modified) ExplanationOfBenefit.addItem.detail.adjudication.amount
comment: (Modified) ClaimResponse.addItem.detail.subDetail.adjudication.amount
comment: (Modified) PackagedProductDefinition.packaging.containedItem.amount
comment: (Modified) ExplanationOfBenefit.payment.amount
comment: (Modified) NutritionProduct.nutrient.amount
comment: (Modified) SubstanceDefinition.moiety.amount
comment: (Modified) Account.balance.amount

species
type: ObjectProperty
comment: SubstanceSourceMaterial.organism.species: The species of an organism shall be specified; refers to the Latin epithet of the species of the plant/animal; it is present in names for species and infraspecies.
comment: SubstanceDefinition.sourceMaterial.species: The species of an organism, typically referring to the Latin epithet of the species of the plant/animal.
modifierExtensionProperty: species
title: SubstanceSourceMaterial.organism.species: The species of an organism shall be specified; refers to the Latin epithet of the species of the plant/animal; it is present in names for species and infraspecies
title: SubstanceDefinition.sourceMaterial.species: The species of an organism e.g. the Latin epithet of the species of the plant/animal

totalNet
type: ObjectProperty
comment: Invoice.totalNet: Invoice total , taxes excluded.
modifierExtensionProperty: _totalNet
title: Invoice.totalNet: Net total of this Invoice

observationRequirement
type: ObjectProperty
comment: ActivityDefinition.observationRequirement: Defines observation requirements for the action to be performed, such as body weight or surface area.
modifierExtensionProperty: _observationRequirement
title: ActivityDefinition.observationRequirement: What observations are required to perform this action

InsurancePlanPlanGeneralCostComponent
type: Class
comment: InsurancePlanPlanComponent.InsurancePlanPlanGeneralCostComponent: Overall costs associated with the plan.
subclass of: BackboneElement
subclass of: Restriction
  max cardinality: 1
  on property: type
subclass of: Restriction
  max cardinality: 1
  on property: groupSize
subclass of: Restriction
  all values from: Money
  on property: cost
subclass of: Restriction
  max cardinality: 1
  on property: cost
subclass of: Restriction
  max cardinality: 1
  on property: comment
subclass of: Restriction
  all values from: string
  on property: comment
subclass of: Restriction
  all values from: positiveInt
  on property: groupSize
subclass of: Restriction
  all values from: CodeableConcept
  on property: type

InvoiceLineItemComponent
type: Class
comment: InvoiceLineItemComponent: Each line item represents one charge for goods and services rendered. Details such.ofType(date), code and amount are found in the referenced ChargeItem resource.
subclass of: BackboneElement
subclass of: Restriction
  all values from: MonetaryComponent
  on property: priceComponent
subclass of:
  union of: Restriction
    all values from: Reference
    on property: chargeItem
  union of: Restriction
    cardinality: 1
    on property: chargeItem
  union of: Restriction
    all values from: CodeableConcept
    on property: chargeItem
  union of: Restriction
    cardinality: 1
    on property: chargeItem
subclass of:
  union of: Restriction
    all values from: date
    on property: serviced
  union of: Restriction
    max cardinality: 1
    on property: serviced
  union of: Restriction
    all values from: Period
    on property: serviced
  union of: Restriction
    max cardinality: 1
    on property: serviced
subclass of: Restriction
  max cardinality: 1
  on property: sequence
subclass of: Restriction
  all values from: positiveInt
  on property: sequence

requestor
type: ObjectProperty
comment: ClaimResponse.requestor: The provider which is responsible for the claim, predetermination or preauthorization.
comment: PaymentReconciliation.requestor: The practitioner who is responsible for the services rendered to the patient.
comment: AuditEvent.entity.agent.requestor: Indicator that the user is or is not the requestor, or initiator, for the event being audited.
comment: CoverageEligibilityResponse.requestor: The provider which is responsible for the request.
comment: AuditEvent.agent.requestor: Indicator that the user is or is not the requestor, or initiator, for the event being audited.
sub property of: who
sub property of: who.source
modifierExtensionProperty: requestor
title: ClaimResponse.requestor: Party responsible for the claim
title: AuditEvent.agent.requestor: Whether user is initiator
title: CoverageEligibilityResponse.requestor: Party responsible for the request
title: AuditEvent.entity.agent.requestor: Whether user is initiator
title: PaymentReconciliation.requestor: Responsible practitioner

dietPreference
type: ObjectProperty
comment: Encounter.dietPreference: Diet preferences reported by the patient.
modifierExtensionProperty: _dietPreference
title: Encounter.dietPreference: Diet preferences reported by the patient

comparator
type: ObjectProperty
comment: SearchParameter.comparator: Comparators supported for the search parameter.
comment: DataRequirement.valueFilter.comparator: The comparator to be used to determine whether the value is matching.
comment: SubstanceDefinition.relationship.comparator: An operator for the amount, for example "average", "approximately", "less than".
comment: SubscriptionTopic.canFilterBy.comparator: Comparators allowed for the filter parameter.
comment: Quantity.comparator: How the value should be understood and represented - whether the actual value is greater or less than the stated value due to measurement issues; e.g. if the comparator is "<" , then the real value is < stated value.
comment: Subscription.filterBy.comparator: Comparator applied to this filter parameter.
modifierExtensionProperty: _comparator
title: DataRequirement.valueFilter.comparator: eq | gt | lt | ge | le | sa | eb
title: Quantity.comparator: < | <= | >= | > | ad - how to understand the value
title: SubscriptionTopic.canFilterBy.comparator: eq | ne | gt | lt | ge | le | sa | eb | ap
title: SubstanceDefinition.relationship.comparator: An operator for the amount, for example "average", "approximately", "less than"
title: SearchParameter.comparator: eq | ne | gt | lt | ge | le | sa | eb | ap
title: Subscription.filterBy.comparator: eq | ne | gt | lt | ge | le | sa | eb | ap

Contract.TermTerm
type: Class
comment: Nested group of Contract Provisions.
subclass of: BackboneElement
subclass of: Restriction
  all values from: ContractOffer
  on property: offer
subclass of: Restriction
  max cardinality: 1
  on property: text
subclass of: Restriction
  max cardinality: 1
  on property: issued
subclass of: Restriction
  all values from: ContractAsset
  on property: asset
subclass of: Restriction
  max cardinality: 1
  on property: identifier
subclass of: Restriction
  all values from: dateTime
  on property: issued
subclass of: Restriction
  all values from: CodeableConcept
  on property: subType
subclass of: Restriction
  max cardinality: 1
  on property: type
subclass of: Restriction
  all values from: Action
  on property: action
subclass of: Restriction
  all values from: Identifier
  on property: identifier
subclass of: Restriction
  max cardinality: 1
  on property: applies
subclass of: Restriction
  all values from: CodeableConcept
  on property: type
subclass of: Restriction
  all values from: SecurityLabel
  on property: securityLabel
subclass of: Restriction
  all values from: string
  on property: text
subclass of: Restriction
  max cardinality: 1
  on property: subType
subclass of: Restriction
  all values from: Contract.TermTermTerm
  on property: group
subclass of: Restriction
  cardinality: 1
  on property: offer
subclass of:
  union of: Restriction
    all values from: CodeableConcept
    on property: topic
  union of: Restriction
    max cardinality: 1
    on property: topic
  union of: Restriction
    all values from: Reference
    on property: topic
  union of: Restriction
    max cardinality: 1
    on property: topic
subclass of: Restriction
  all values from: Period
  on property: applies
title: Nested Contract Term Group

_combinedPharmaceuticalDoseForm
type: ObjectProperty
comment: (Modified) MedicinalProductDefinition.combinedPharmaceuticalDoseForm

servicePeriod
type: ObjectProperty
comment: Account.servicePeriod: The date range of services associated with this account.
sub property of: when.done
modifierExtensionProperty: servicePeriod
title: Account.servicePeriod: Transaction window

CodeSystem.ConceptDefinitionConcept
type: Class
comment: Defines children of a concept to produce a hierarchy of concepts. The nature of the relationships is variable (is-a/contains/categorizes) - see hierarchyMeaning.
subclass of: BackboneElement
subclass of: Restriction
  all values from: code
  on property: code
subclass of: Restriction
  all values from: CodeSystem.ConceptDefinitionConceptConcept
  on property: concept
subclass of: Restriction
  all values from: string
  on property: definition
subclass of: Restriction
  all values from: string
  on property: display
subclass of: Restriction
  cardinality: 1
  on property: code
subclass of: Restriction
  all values from: CodeSystemConceptDesignationComponent
  on property: designation
subclass of: Restriction
  max cardinality: 1
  on property: definition
subclass of: Restriction
  max cardinality: 1
  on property: display
subclass of: Restriction
  all values from: ConceptProperty
  on property: property
title: Child Concepts (is-a/contains/categorizes)

_rater
type: ObjectProperty
comment: (Modified) Evidence.certainty.subcomponent.rater
comment: (Modified) Evidence.certainty.rater

receiverActive
type: ObjectProperty
comment: ExampleScenario.process.step.process.step.alternative.step.operation.receiverActive: If false, the receiver is deactivated right after the operation.
comment: ExampleScenario.process.step.alternative.step.process.step.operation.receiverActive: If false, the receiver is deactivated right after the operation.
comment: ExampleScenario.process.step.operation.receiverActive: If false, the receiver is deactivated right after the operation.
comment: ExampleScenario.process.step.process.step.operation.receiverActive: If false, the receiver is deactivated right after the operation.
comment: ExampleScenario.process.step.alternative.step.operation.receiverActive: If false, the receiver is deactivated right after the operation.
modifierExtensionProperty: _receiverActive
title: ExampleScenario.process.step.alternative.step.process.step.operation.receiverActive: Receiver stays active?
title: ExampleScenario.process.step.process.step.alternative.step.operation.receiverActive: Receiver stays active?
title: ExampleScenario.process.step.process.step.operation.receiverActive: Receiver stays active?
title: ExampleScenario.process.step.operation.receiverActive: Receiver stays active?
title: ExampleScenario.process.step.alternative.step.operation.receiverActive: Receiver stays active?

modification
type: ObjectProperty
comment: SubstancePolymer.modification: Todo - this is intended to connect to a repeating full modification structure, also used by Protein and Nucleic Acid . String is just a placeholder.
modifierExtensionProperty: _modification
title: SubstancePolymer.modification: Todo - this is intended to connect to a repeating full modification structure, also used by Protein and Nucleic Acid . String is just a placeholder

practitioner
type: ObjectProperty
comment: PractitionerRole.practitioner: Practitioner that is able to provide the defined services for the organization.
modifierExtensionProperty: practitioner
title: PractitionerRole.practitioner: Practitioner that provides services for the organization

_normalCodedValueSet
type: ObjectProperty
comment: (Modified) ObservationDefinition.component.qualifiedValue.normalCodedValueSet
comment: (Modified) ObservationDefinition.qualifiedValue.normalCodedValueSet

TestCaseDependency
type: Class
comment: TestPlanTestCaseComponent.TestCaseDependency: The required criteria to execute the test case - e.g. preconditions, previous tests.
subclass of: BackboneElement
subclass of: Restriction
  max cardinality: 1
  on property: predecessor
subclass of: Restriction
  all values from: Reference
  on property: predecessor
subclass of: Restriction
  max cardinality: 1
  on property: description
subclass of: Restriction
  all values from: markdown
  on property: description

_costToBeneficiary
type: ObjectProperty
comment: (Modified) Coverage.costToBeneficiary

MessageHeader
type: Class
comment: The header for a message exchange that is either requesting or responding to an action. The reference(s) that are the subject of the action as well as other information related to the action are typically transmitted in a bundle in which the MessageHeader resource instance is the first resource in the bundle.
subclass of: infrastructure.exchange
subclass of: DomainResource
subclass of: Restriction
  all values from: MessageDestination
  on property: destination
subclass of: Restriction
  all values from: MessageHeaderResponseComponent
  on property: response
subclass of: Restriction
  max cardinality: 1
  on property: responsible
subclass of: Restriction
  all values from: Reference
  on property: responsible
subclass of: Restriction
  all values from: MessageSource
  on property: source
subclass of:
  union of: Restriction
    all values from: Coding
    on property: event
  union of: Restriction
    cardinality: 1
    on property: event
  union of: Restriction
    all values from: canonical
    on property: event
  union of: Restriction
    cardinality: 1
    on property: event
subclass of: Restriction
  all values from: canonical
  on property: definition
subclass of: Restriction
  max cardinality: 1
  on property: reason
subclass of: Restriction
  all values from: Reference
  on property: sender
subclass of: Restriction
  max cardinality: 1
  on property: sender
subclass of: Restriction
  all values from: Reference
  on property: author
subclass of: Restriction
  cardinality: 1
  on property: source
subclass of: Restriction
  max cardinality: 1
  on property: author
subclass of: Restriction
  max cardinality: 1
  on property: response
subclass of: Restriction
  all values from: Reference
  on property: focus
subclass of: Restriction
  max cardinality: 1
  on property: definition
subclass of: Restriction
  all values from: CodeableConcept
  on property: reason
modifierExtensionClass: MessageHeader

ResearchStudyRecruitmentComponent
type: Class
comment: ResearchStudyRecruitmentComponent: Target or actual group of participants enrolled in study.
subclass of: BackboneElement
subclass of: Restriction
  all values from: unsignedInt
  on property: targetNumber
subclass of: Restriction
  all values from: Reference
  on property: eligibility
subclass of: Restriction
  max cardinality: 1
  on property: eligibility
subclass of: Restriction
  all values from: unsignedInt
  on property: actualNumber
subclass of: Restriction
  max cardinality: 1
  on property: actualNumber
subclass of: Restriction
  all values from: Reference
  on property: actualGroup
subclass of: Restriction
  max cardinality: 1
  on property: targetNumber
subclass of: Restriction
  max cardinality: 1
  on property: actualGroup

_forenameInitials
type: ObjectProperty
comment: (Modified) Citation.citedArtifact.contributorship.entry.forenameInitials

plannedStartDate
type: ObjectProperty
comment: EncounterHistory.plannedStartDate: The planned start date/time (or admission date) of the encounter.
comment: Encounter.plannedStartDate: The planned start date/time (or admission date) of the encounter.
modifierExtensionProperty: plannedStartDate
title: EncounterHistory.plannedStartDate: The planned start date/time (or admission date) of the encounter
title: Encounter.plannedStartDate: The planned start date/time (or admission date) of the encounter

study
type: ObjectProperty
comment: ResearchSubject.study: Reference to the study the subject is participating in.
comment: DiagnosticReport.study: One or more links to full details of any study performed during the diagnostic investigation. An ImagingStudy might comprise a set of radiologic images obtained via a procedure that are analyzed as a group. Typically, this is imaging performed by DICOM enabled modalities, but this is not required. A fully enabled PACS viewer can use this information to provide views of the source images. A GenomicStudy might comprise one or more analyses, each serving a specific purpose. These analyses may vary in method (e.g., karyotyping, CNV, or SNV detection), performer, software, devices used, or regions targeted.
comment: AdverseEvent.study: The research study that the subject is enrolled in.
modifierExtensionProperty: study
title: ResearchSubject.study: Study subject is part of
title: DiagnosticReport.study: Reference to full details of an analysis associated with the diagnostic report
title: AdverseEvent.study: Research study that the subject is enrolled in

groupIdentifier
type: ObjectProperty
comment: NutritionOrder.groupIdentifier: A shared identifier common to all nutrition orders that were authorized more or less simultaneously by a single author, representing the composite or group identifier.
comment: CommunicationRequest.groupIdentifier: A shared identifier common to multiple independent Request instances that were activated/authorized more or less simultaneously by a single author. The presence of the same identifier on each request ties those requests together and may have business ramifications in terms of reporting of results, billing, etc. E.g. a requisition number shared by a set of lab tests ordered together, or a prescription number shared by all meds ordered at one time.
comment: Task.groupIdentifier: A shared identifier common to multiple independent Task and Request instances that were activated/authorized more or less simultaneously by a single author. The presence of the same identifier on each request ties those requests together and may have business ramifications in terms of reporting of results, billing, etc. E.g. a requisition number shared by a set of lab tests ordered together, or a prescription number shared by all meds ordered at one time.
comment: Transport.groupIdentifier: A shared identifier common to multiple independent Request instances that were activated/authorized more or less simultaneously by a single author. The presence of the same identifier on each request ties those requests together and may have business ramifications in terms of reporting of results, billing, etc. E.g. a requisition number shared by a set of lab tests ordered together, or a prescription number shared by all meds ordered at one time.
comment: RequestOrchestration.groupIdentifier: A shared identifier common to multiple independent Request instances that were activated/authorized more or less simultaneously by a single author. The presence of the same identifier on each request ties those requests together and may have business ramifications in terms of reporting of results, billing, etc. E.g. a requisition number shared by a set of lab tests ordered together, or a prescription number shared by all meds ordered at one time.
comment: DeviceRequest.groupIdentifier: A shared identifier common to multiple independent Request instances that were activated/authorized more or less simultaneously by a single author. The presence of the same identifier on each request ties those requests together and may have business ramifications in terms of reporting of results, billing, etc. E.g. a requisition number shared by a set of lab tests ordered together, or a prescription number shared by all meds ordered at one time.
comment: MedicationRequest.groupIdentifier: A shared identifier common to multiple independent Request instances that were activated/authorized more or less simultaneously by a single author. The presence of the same identifier on each request ties those requests together and may have business ramifications in terms of reporting of results, billing, etc. E.g. a requisition number shared by a set of lab tests ordered together, or a prescription number shared by all meds ordered at one time.
modifierExtensionProperty: groupIdentifier
title: MedicationRequest.groupIdentifier: Composite request this is part of
title: CommunicationRequest.groupIdentifier: Composite request this is part of
title: Transport.groupIdentifier: Requisition or grouper id
title: Task.groupIdentifier: Requisition or grouper id
title: DeviceRequest.groupIdentifier: Identifier of composite request
title: RequestOrchestration.groupIdentifier: Composite request this is part of
title: NutritionOrder.groupIdentifier: Composite Request ID

_participatingOrganization
type: ObjectProperty
comment: (Modified) OrganizationAffiliation.participatingOrganization

MeasureGroupStratifierComponent
type: Class
comment: MeasureGroupComponent.MeasureGroupStratifierComponent: The stratifier criteria for the measure report, specified as either the name of a valid CQL expression defined within a referenced library or a valid FHIR Resource Path.
subclass of: BackboneElement
subclass of: Restriction
  all values from: CodeableConcept
  on property: code
subclass of: Restriction
  max cardinality: 1
  on property: criteria
subclass of: Restriction
  max cardinality: 1
  on property: linkId
subclass of: Restriction
  all values from: string
  on property: linkId
subclass of: Restriction
  all values from: MeasureGroupStratifierComponentComponent
  on property: component
subclass of: Restriction
  all values from: markdown
  on property: description
subclass of: Restriction
  max cardinality: 1
  on property: groupDefinition
subclass of: Restriction
  max cardinality: 1
  on property: code
subclass of: Restriction
  max cardinality: 1
  on property: description
subclass of: Restriction
  all values from: Expression
  on property: criteria
subclass of: Restriction
  all values from: Reference
  on property: groupDefinition

wednesday
type: ObjectProperty
comment: Appointment.recurrenceTemplate.weeklyTemplate.wednesday: Indicates that recurring appointments should occur on Wednesdays.
modifierExtensionProperty: wednesday
title: Appointment.recurrenceTemplate.weeklyTemplate.wednesday: Recurs on Wednesday

_diameter
type: ObjectProperty
comment: (Modified) VisionPrescription.lensSpecification.diameter

enteralFormula
type: ObjectProperty
comment: NutritionOrder.enteralFormula: Feeding provided through the gastrointestinal tract via a tube, catheter, or stoma that delivers nutrition distal to the oral cavity.
modifierExtensionProperty: _enteralFormula
title: NutritionOrder.enteralFormula: Enteral formula components

_stabilityDuration
type: ObjectProperty
comment: (Modified) MedicationKnowledge.storageGuideline.stabilityDuration

integer
type: Class
comment: A whole number
subclass of: Primitive
subclass of: Restriction
  cardinality: 1
  on property: http://hl7.org/fhir/v
subclass of: Restriction
  all values from: integer
  on property: http://hl7.org/fhir/v

domain
type: ObjectProperty
comment: SubstanceDefinition.name.translation.domain: The use context of this name for example if there is a different name a drug active ingredient as opposed to a food colour additive.
comment: MedicinalProductDefinition.domain: If this medicine applies to human or veterinary uses.
comment: SubstanceDefinition.name.synonym.domain: The use context of this name for example if there is a different name a drug active ingredient as opposed to a food colour additive.
comment: SubstanceDefinition.domain: If the substance applies to human or veterinary use.
comment: SubstanceDefinition.name.domain: The use context of this name for example if there is a different name a drug active ingredient as opposed to a food colour additive.
comment: Contract.domain: Recognized governance framework or system operating with a circumscribed scope in accordance with specified principles, policies, processes or procedures for managing rights, actions, or behaviors of parties or principals relative to resources.
modifierExtensionProperty: _domain
title: SubstanceDefinition.name.synonym.domain: The use context of this name e.g. as an active ingredient or as a food colour additive
title: Contract.domain: A sphere of control governed by an authoritative jurisdiction, organization, or person
title: SubstanceDefinition.name.domain: The use context of this name e.g. as an active ingredient or as a food colour additive
title: SubstanceDefinition.domain: If the substance applies to human or veterinary use
title: MedicinalProductDefinition.domain: If this medicine applies to human or veterinary uses
title: SubstanceDefinition.name.translation.domain: The use context of this name e.g. as an active ingredient or as a food colour additive

_periodType
type: ObjectProperty
comment: (Modified) Contract.term.group.asset.periodType
comment: (Modified) Contract.term.asset.periodType

_ImagingStudy
type: Class
comment: (Modified) ImagingStudy
subclass of: DomainResource

searchRevInclude
type: ObjectProperty
comment: CapabilityStatement.rest.resource.searchRevInclude: A list of _revinclude (reverse include) values supported by the server.
modifierExtensionProperty: searchRevInclude
title: CapabilityStatement.rest.resource.searchRevInclude: _revinclude values supported by the server

_relatedAction
type: ObjectProperty
comment: (Modified) RequestOrchestration.action.action.relatedAction
comment: (Modified) RequestOrchestration.action.relatedAction
comment: (Modified) PlanDefinition.action.action.relatedAction
comment: (Modified) PlanDefinition.action.relatedAction

observed
type: ObjectProperty
comment: Evidence.variableDefinition.observed: Definition of the actual variable related to the statistic(s).
modifierExtensionProperty: _observed
title: Evidence.variableDefinition.observed: Definition of the actual variable related to the statistic(s)

born
type: ObjectProperty
comment: FamilyMemberHistory.born
modifierExtensionProperty: born

_ImmunizationRecommendation
type: Class
comment: (Modified) ImmunizationRecommendation
subclass of: DomainResource

service
type: ObjectProperty
comment: ChargeItem.service: Indicated the rendered service that caused this charge.
comment: CapabilityStatement.rest.security.service: Types of security services that are supported/required by the system.
sub property of: why
modifierExtensionProperty: service
title: ChargeItem.service: Which rendered service is being charged?
title: CapabilityStatement.rest.security.service: OAuth | SMART-on-FHIR | NTLM | Basic | Kerberos | Certificates

_requestIdentifier
type: ObjectProperty
comment: (Modified) GuidanceResponse.requestIdentifier

maxDosePerLifetime
type: ObjectProperty
comment: Dosage.maxDosePerLifetime: Upper limit on medication per lifetime of the patient.
modifierExtensionProperty: maxDosePerLifetime
title: Dosage.maxDosePerLifetime: Upper limit on medication per lifetime of the patient

format
type: ObjectProperty
comment: SubstancePolymer.repeat.repeatUnit.structuralRepresentation.format: The format of the representation e.g. InChI, SMILES, MOLFILE, CDX, SDF, PDB, mmCIF.
comment: SubstanceDefinition.structure.representation.format: The format of the representation e.g. InChI, SMILES, MOLFILE, CDX, SDF, PDB, mmCIF. The logical content type rather than the physical file format of a document.
comment: CapabilityStatement.format: A list of the formats supported by this implementation using their content types.
modifierExtensionProperty: format
title: SubstancePolymer.repeat.repeatUnit.structuralRepresentation.format: The format of the representation e.g. InChI, SMILES, MOLFILE, CDX, SDF, PDB, mmCIF
title: SubstanceDefinition.structure.representation.format: The format of the representation e.g. InChI, SMILES, MOLFILE (note: not the physical file format)
title: CapabilityStatement.format: formats supported (xml | json | ttl | mime type)

_isSummary
type: ObjectProperty
comment: (Modified) ElementDefinition.isSummary

supportingInfoSequence
type: ObjectProperty
comment: CoverageEligibilityRequest.item.supportingInfoSequence: Exceptions, special conditions and supporting information applicable for this service or product line.
modifierExtensionProperty: _supportingInfoSequence
title: CoverageEligibilityRequest.item.supportingInfoSequence: Applicable exception or supporting information

ClaimResponse.AddedItem.AddedItemDetail.AddedItemSubDetailAdjudication
type: Class
comment: The adjudication results.
subclass of: BackboneElement
subclass of: Restriction
  max cardinality: 1
  on property: reason
subclass of: Restriction
  all values from: Quantity
  on property: quantity
subclass of: Restriction
  max cardinality: 1
  on property: amount
subclass of: Restriction
  all values from: Money
  on property: amount
subclass of: Restriction
  all values from: CodeableConcept
  on property: category
subclass of: Restriction
  all values from: CodeableConcept
  on property: reason
subclass of: Restriction
  max cardinality: 1
  on property: quantity
subclass of: Restriction
  cardinality: 1
  on property: category
title: Added items subdetail adjudication

EvidenceStatisticModelCharacteristicVariableComponent
type: Class
comment: EvidenceStatisticComponent.EvidenceStatisticModelCharacteristicComponent.EvidenceStatisticModelCharacteristicVariableComponent: A variable adjusted for in the adjusted analysis.
subclass of: BackboneElement
subclass of: Restriction
  max cardinality: 1
  on property: handling
subclass of: Restriction
  all values from: code
  on property: handling
subclass of: Restriction
  all values from: CodeableConcept
  on property: valueCategory
subclass of: Restriction
  all values from: Range
  on property: valueRange
subclass of: Restriction
  cardinality: 1
  on property: variableDefinition
subclass of: Restriction
  all values from: Quantity
  on property: valueQuantity
subclass of: Restriction
  all values from: Reference
  on property: variableDefinition

ManufacturedItemDefinitionPropertyComponent
type: Class
comment: ManufacturedItemDefinitionPropertyComponent: General characteristics of this item.
subclass of: BackboneElement
subclass of:
  union of: Restriction
    all values from: CodeableConcept
    on property: value
  union of: Restriction
    max cardinality: 1
    on property: value
  union of: Restriction
    all values from: Quantity
    on property: value
  union of: Restriction
    max cardinality: 1
    on property: value
  union of: Restriction
    all values from: date
    on property: value
  union of: Restriction
    max cardinality: 1
    on property: value
  union of: Restriction
    all values from: boolean
    on property: value
  union of: Restriction
    max cardinality: 1
    on property: value
  union of: Restriction
    all values from: markdown
    on property: value
  union of: Restriction
    max cardinality: 1
    on property: value
  union of: Restriction
    all values from: Attachment
    on property: value
  union of: Restriction
    max cardinality: 1
    on property: value
  union of: Restriction
    all values from: Reference
    on property: value
  union of: Restriction
    max cardinality: 1
    on property: value
subclass of: Restriction
  cardinality: 1
  on property: type
subclass of: Restriction
  all values from: CodeableConcept
  on property: type

_concentration
type: ObjectProperty
comment: (Modified) Ingredient.substance.strength.concentration

coordinate
type: ObjectProperty
comment: ImagingSelection.instance.imageRegion3D.coordinate: The coordinates describing the image region. Encoded as an ordered set of (x,y,z) triplets (in mm and may be negative) that define a region of interest in the patient-relative Reference Coordinate System defined by ImagingSelection.frameOfReferenceUid element.
comment: ImagingSelection.instance.imageRegion2D.coordinate: The coordinates describing the image region. Encoded as a set of (column, row) pairs that denote positions in the selected image / frames specified with sub-pixel resolution. The origin at the TLHC of the TLHC pixel is 0.0\0.0, the BRHC of the TLHC pixel is 1.0\1.0, and the BRHC of the BRHC pixel is the number of columns\rows in the image / frames. The values must be within the range 0\0 to the number of columns\rows in the image / frames.
modifierExtensionProperty: _coordinate
title: ImagingSelection.instance.imageRegion3D.coordinate: Specifies the coordinates that define the image region
title: ImagingSelection.instance.imageRegion2D.coordinate: Specifies the coordinates that define the image region

AddedItemDetailSubDetail
type: Class
comment: ExplanationOfBenefit.AddedItem.AddedItemDetail.AddedItemDetailSubDetail: The third-tier service adjudications for payor added services.
subclass of: BackboneElement
subclass of: Restriction
  max cardinality: 1
  on property: revenue
subclass of: Restriction
  all values from: CodeableConcept
  on property: revenue
subclass of: Restriction
  max cardinality: 1
  on property: tax
subclass of: Restriction
  all values from: CodeableConcept
  on property: modifier
subclass of: Restriction
  max cardinality: 1
  on property: net
subclass of: Restriction
  all values from: Money
  on property: unitPrice
subclass of: Restriction
  max cardinality: 1
  on property: patientPaid
subclass of: Restriction
  all values from: Money
  on property: patientPaid
subclass of: Restriction
  all values from: Identifier
  on property: traceNumber
subclass of: Restriction
  max cardinality: 1
  on property: productOrServiceEnd
subclass of: Restriction
  all values from: ExplanationOfBenefit.AddedItem.AddedItemDetail.AddedItemDetailSubDetailReviewOutcome
  on property: reviewOutcome
subclass of: Restriction
  all values from: ExplanationOfBenefit.AddedItem.AddedItemDetail.AddedItemDetailSubDetailAdjudication
  on property: adjudication
subclass of: Restriction
  all values from: CodeableConcept
  on property: productOrServiceEnd
subclass of: Restriction
  all values from: CodeableConcept
  on property: productOrService
subclass of: Restriction
  all values from: decimal
  on property: factor
subclass of: Restriction
  max cardinality: 1
  on property: quantity
subclass of: Restriction
  all values from: SimpleQuantity
  on property: quantity
subclass of: Restriction
  max cardinality: 1
  on property: reviewOutcome
subclass of: Restriction
  all values from: Money
  on property: tax
subclass of: Restriction
  max cardinality: 1
  on property: factor
subclass of: Restriction
  max cardinality: 1
  on property: unitPrice
subclass of: Restriction
  max cardinality: 1
  on property: productOrService
subclass of: Restriction
  all values from: Money
  on property: net
subclass of: Restriction
  all values from: positiveInt
  on property: noteNumber

TerminologyCapabilitiesTranslationComponent
type: Class
comment: TerminologyCapabilitiesTranslationComponent: Information about the [ConceptMap/$translate](conceptmap-operation-translate.html) operation.
subclass of: BackboneElement
subclass of: Restriction
  cardinality: 1
  on property: needsMap
subclass of: Restriction
  all values from: boolean
  on property: needsMap

_generalPractitioner
type: ObjectProperty
comment: (Modified) Patient.generalPractitioner

_protocol
type: ObjectProperty
comment: (Modified) ResearchStudy.protocol
comment: (Modified) ClinicalImpression.protocol
comment: (Modified) CapabilityStatement.messaging.endpoint.protocol

_exception
type: ObjectProperty
comment: (Modified) Coverage.costToBeneficiary.exception

_complication
type: ObjectProperty
comment: (Modified) Procedure.complication

value
type: ObjectProperty
comment: CodeSystem.filter.value: A description of what the value for the filter should be.
comment: ConditionDefinition.precondition.value
comment: Device.property.value
comment: InsurancePlan.coverage.benefit.limit.value: The maximum amount of a service item a plan will pay for a covered benefit. For examples. wellness visits, or eyeglasses.
comment: ValueSet.expansion.contains.property.value
comment: Questionnaire.item.item.answerOption.value
comment: ValueSet.compose.include.filter.value: The match value may be either a code defined by the system, or a string value, which is a regex match on the literal string of the property value (if the filter represents a property defined in CodeSystem) or of the system filter value (if the filter represents a filter defined in CodeSystem) when the operation is 'regex', or one of the values (true and false), when the operation is 'exists'.
comment: AuditEvent.entity.detail.value
comment: Contract.term.group.asset.answer.value
comment: QuestionnaireResponse.item.answer.item.answer.value
comment: EvidenceReport.subject.characteristic.value
comment: CodeSystem.concept.concept.property.value
comment: PackagedProductDefinition.characteristic.value
comment: EvidenceVariable.characteristic.definitionByTypeAndValue.value
comment: ValueSet.expansion.contains.designation.value: The text value for this designation.
comment: Group.characteristic.value
comment: AdministrableProductDefinition.property.value
comment: UsageContext.value
comment: BodyStructure.excludedStructure.bodyLandmarkOrientation.distanceFromLandmark.value: The measured distance (e.g., in cm) from a body landmark.
comment: Evidence.statistic.modelCharacteristic.value: Further specification of the quantified value of the component of the method to generate the statistic.
comment: NutritionProduct.characteristic.value
comment: EvidenceVariable.category.value
comment: Questionnaire.item.initial.value
comment: AdministrableProductDefinition.routeOfAdministration.targetSpecies.withdrawalPeriod.value: A value for the time.
comment: Citation.citedArtifact.part.value: The specification of the component.
comment: ValueSet.expansion.contains.contains.property.subProperty.value
comment: Subscription.parameter.value: Parameter value for information passed to the channel for notifications, for example in the case of a REST hook wanting to pass through an authorization header, the value would be `Bearer 0193...`.
comment: MedicationKnowledge.indicationGuideline.dosingGuideline.patientCharacteristic.value
comment: StructureMap.group.rule.dependent.parameter.value
comment: ValueSet.compose.include.concept.designation.value: The text value for this designation.
comment: InsurancePlan.plan.specificCost.benefit.cost.value: The actual cost value. (some of the costs may be represented as percentages rather than currency, e.g. 10% coinsurance).
comment: TestScript.setup.action.assert.value: The value to compare to.
comment: StructureMap.group.rule.target.parameter.value
comment: DataRequirement.valueFilter.value
comment: StructureMap.const.value: A FHIRPath expression that is the value of this variable.
comment: ContactPoint.value: The actual contact point details, in a form that is meaningful to the designated communication system (i.e. phone number or email address).
comment: DataRequirement.dateFilter.value
comment: DeviceDefinition.property.value
comment: CodeSystem.concept.concept.designation.value: The text value for this designation.
comment: ValueSet.expansion.contains.contains.designation.value: The text value for this designation.
comment: StructureMap.group.rule.rule.dependent.parameter.value
comment: DocumentReference.content.profile.value
comment: MeasureReport.group.stratifier.stratum.component.value
comment: TestScript.test.action.assert.value: The value to compare to.
comment: PackagedProductDefinition.packaging.packaging.property.value
comment: NamingSystem.uniqueId.value: The string that should be sent over the wire to identify the code system or identifier system.
comment: MeasureReport.group.stratifier.stratum.value
comment: ManufacturedItemDefinition.component.component.property.value
comment: ValueSet.expansion.parameter.value
comment: DeviceDefinition.version.value: The version text.
comment: TestScript.setup.action.operation.requestHeader.value: The value of the header e.g. "application/fhir+xml".
comment: Encounter.reason.value: Reason the encounter takes place, expressed as a code or a reference to another resource. For admissions, this can be used for a coded admission diagnosis.
comment: BodyStructure.includedStructure.bodyLandmarkOrientation.distanceFromLandmark.value: The measured distance (e.g., in cm) from a body landmark.
comment: ManufacturedItemDefinition.property.value
comment: ConceptMap.group.element.target.product.value
comment: ExplanationOfBenefit.supportingInfo.value
comment: Citation.citedArtifact.contributorship.summary.value: The display string for the author list, contributor list, or contributorship statement.
comment: SupplyRequest.parameter.value
comment: ValueSet.compose.exclude.filter.value: The match value may be either a code defined by the system, or a string value, which is a regex match on the literal string of the property value (if the filter represents a property defined in CodeSystem) or of the system filter value (if the filter represents a filter defined in CodeSystem) when the operation is 'regex', or one of the values (true and false), when the operation is 'exists'.
comment: Observation.value
comment: QuestionnaireResponse.item.answer.value
comment: SubstanceDefinition.property.value
comment: ResearchStudy.label.value: The name.
comment: Claim.supportingInfo.value
comment: ImmunizationRecommendation.recommendation.dateCriterion.value: The date whose meaning is specified by dateCriterion.code.
comment: TestScript.test.action.operation.requestHeader.value: The value of the header e.g. "application/fhir+xml".
comment: Contract.term.offer.answer.value
comment: ImplementationGuide.definition.parameter.value: Value for named type.
comment: BiologicallyDerivedProduct.property.value
comment: Identifier.value: The portion of the identifier typically relevant to the user and which is unique within the context of the system.
comment: ValueSet.expansion.contains.property.subProperty.value
comment: Citation.citedArtifact.version.value: The version number or other version identifier.
comment: DeviceRequest.parameter.value
comment: TestScript.teardown.action.operation.requestHeader.value: The value of the header e.g. "application/fhir+xml".
comment: Coverage.class.value: The alphanumeric identifier associated with the insurer issued label.
sub property of: what
sub property of: id
sub property of: why
modifierExtensionProperty: value

_nthWeekOfMonth
type: ObjectProperty
comment: (Modified) Appointment.recurrenceTemplate.monthlyTemplate.nthWeekOfMonth

_url
type: ObjectProperty
comment: (Modified) ActorDefinition.url
comment: (Modified) StructureDefinition.url
comment: (Modified) ActivityDefinition.url
comment: (Modified) Citation.url
comment: (Modified) Questionnaire.url
comment: (Modified) TerminologyCapabilities.url
comment: (Modified) Citation.citedArtifact.webLocation.url
comment: (Modified) SpecimenDefinition.url
comment: (Modified) NamingSystem.url
comment: (Modified) TestScript.teardown.action.operation.url
comment: (Modified) Library.url
comment: (Modified) StructureMap.structure.url
comment: (Modified) ValueSet.url
comment: (Modified) ChargeItemDefinition.url
comment: (Modified) OperationDefinition.url
comment: (Modified) EvidenceReport.url
comment: (Modified) PlanDefinition.url
comment: (Modified) TestScript.url
comment: (Modified) TestPlan.url
comment: (Modified) Consent.policyBasis.url
comment: (Modified) Bundle.entry.link.url
comment: (Modified) EventDefinition.url
comment: (Modified) ConceptMap.url
comment: (Modified) CodeSystem.url
comment: (Modified) CompartmentDefinition.url
comment: (Modified) GraphDefinition.url
comment: (Modified) TestScript.setup.action.operation.url
comment: (Modified) TestScript.test.action.operation.url
comment: (Modified) Device.url
comment: (Modified) TestScript.destination.url
comment: (Modified) Attachment.url
comment: (Modified) CapabilityStatement.url
comment: (Modified) Requirements.url
comment: (Modified) SearchParameter.url
comment: (Modified) MessageDefinition.url
comment: (Modified) Bundle.entry.request.url
comment: (Modified) ExampleScenario.url
comment: (Modified) Composition.url
comment: (Modified) TestScript.origin.url
comment: (Modified) TerminologyCapabilities.implementation.url
comment: (Modified) TestScript.metadata.link.url
comment: (Modified) EvidenceReport.relatesTo.target.url
comment: (Modified) Bundle.link.url
comment: (Modified) ConditionDefinition.url
comment: (Modified) ImplementationGuide.url
comment: (Modified) SubscriptionTopic.url
comment: (Modified) ResearchStudy.url
comment: (Modified) EvidenceVariable.url
comment: (Modified) Extension.url
comment: (Modified) Evidence.url
comment: (Modified) CanonicalResource.url
comment: (Modified) ObservationDefinition.url
comment: (Modified) Measure.url
comment: (Modified) StructureMap.url
comment: (Modified) CapabilityStatement.implementation.url
comment: (Modified) Contract.url

SubstanceSourceMaterialOrganismHybridComponent
type: Class
comment: SubstanceSourceMaterialOrganismComponent.SubstanceSourceMaterialOrganismHybridComponent: 4.9.13.8.1 Hybrid species maternal organism ID (Optional).
subclass of: BackboneElement
subclass of: Restriction
  max cardinality: 1
  on property: paternalOrganismId
subclass of: Restriction
  all values from: CodeableConcept
  on property: hybridType
subclass of: Restriction
  all values from: string
  on property: paternalOrganismId
subclass of: Restriction
  all values from: string
  on property: maternalOrganismName
subclass of: Restriction
  max cardinality: 1
  on property: hybridType
subclass of: Restriction
  max cardinality: 1
  on property: maternalOrganismId
subclass of: Restriction
  max cardinality: 1
  on property: paternalOrganismName
subclass of: Restriction
  all values from: string
  on property: maternalOrganismId
subclass of: Restriction
  all values from: string
  on property: paternalOrganismName
subclass of: Restriction
  max cardinality: 1
  on property: maternalOrganismName

SubscriptionTopicEventTriggerComponent
type: Class
comment: SubscriptionTopicEventTriggerComponent: Event definition which can be used to trigger the SubscriptionTopic.
subclass of: BackboneElement
subclass of: Restriction
  all values from: uri
  on property: resource
subclass of: Restriction
  cardinality: 1
  on property: resource
subclass of: Restriction
  max cardinality: 1
  on property: description
subclass of: Restriction
  all values from: markdown
  on property: description
subclass of: Restriction
  cardinality: 1
  on property: event
subclass of: Restriction
  all values from: CodeableConcept
  on property: event

MedicinalProductDefinitionNameComponent
type: Class
comment: MedicinalProductDefinitionNameComponent: The product's name, including full name and possibly coded parts.
subclass of: BackboneElement
subclass of: Restriction
  all values from: MedicinalProductDefinitionNameUsageComponent
  on property: usage
subclass of: Restriction
  cardinality: 1
  on property: productName
subclass of: Restriction
  all values from: string
  on property: productName
subclass of: Restriction
  all values from: CodeableConcept
  on property: type
subclass of: Restriction
  max cardinality: 1
  on property: type
subclass of: Restriction
  all values from: MedicinalProductDefinitionNamePartComponent
  on property: part

SubstanceSourceMaterialOrganismComponent
type: Class
comment: SubstanceSourceMaterialOrganismComponent: This subclause describes the organism which the substance is derived from. For vaccines, the parent organism shall be specified based on these subclause elements. As an example, full taxonomy will be described for the Substance Name: ., Leaf.
subclass of: BackboneElement
subclass of: Restriction
  max cardinality: 1
  on property: intraspecificDescription
subclass of: Restriction
  all values from: CodeableConcept
  on property: family
subclass of: Restriction
  all values from: SubstanceSourceMaterialOrganismAuthorComponent
  on property: author
subclass of: Restriction
  all values from: CodeableConcept
  on property: species
subclass of: Restriction
  max cardinality: 1
  on property: intraspecificType
subclass of: Restriction
  max cardinality: 1
  on property: genus
subclass of: Restriction
  all values from: string
  on property: intraspecificDescription
subclass of: Restriction
  all values from: CodeableConcept
  on property: intraspecificType
subclass of: Restriction
  all values from: CodeableConcept
  on property: genus
subclass of: Restriction
  all values from: SubstanceSourceMaterialOrganismHybridComponent
  on property: hybrid
subclass of: Restriction
  all values from: SubstanceSourceMaterialOrganismOrganismGeneralComponent
  on property: organismGeneral
subclass of: Restriction
  max cardinality: 1
  on property: organismGeneral
subclass of: Restriction
  max cardinality: 1
  on property: species
subclass of: Restriction
  max cardinality: 1
  on property: hybrid
subclass of: Restriction
  max cardinality: 1
  on property: family

overrideReason
type: ObjectProperty
comment: ChargeItem.overrideReason: If the list price or the rule-based factor associated with the code is overridden, this attribute can capture a text to indicate the reason for this action.
modifierExtensionProperty: overrideReason
title: ChargeItem.overrideReason: Reason for overriding the list price/factor

pages
type: ObjectProperty
comment: Attachment.pages: The number of pages when printed.
modifierExtensionProperty: pages
title: Attachment.pages: Number of printed pages

_conclusion
type: ObjectProperty
comment: (Modified) DiagnosticReport.conclusion

_combined
type: ObjectProperty
comment: (Modified) Specimen.combined

_contains
type: ObjectProperty
comment: (Modified) ValueSet.expansion.contains.contains
comment: (Modified) ValueSet.expansion.contains.contains.contains
comment: (Modified) ValueSet.expansion.contains

_documentType
type: ObjectProperty
comment: (Modified) Consent.provision.provision.documentType
comment: (Modified) Consent.provision.documentType

MeasureGroupStratifierComponentComponent
type: Class
comment: MeasureGroupComponent.MeasureGroupStratifierComponent.MeasureGroupStratifierComponentComponent: A component of the stratifier criteria for the measure report, specified as either the name of a valid CQL expression defined within a referenced library or a valid FHIR Resource Path.
subclass of: BackboneElement
subclass of: Restriction
  max cardinality: 1
  on property: code
subclass of: Restriction
  all values from: string
  on property: linkId
subclass of: Restriction
  max cardinality: 1
  on property: criteria
subclass of: Restriction
  all values from: markdown
  on property: description
subclass of: Restriction
  max cardinality: 1
  on property: groupDefinition
subclass of: Restriction
  max cardinality: 1
  on property: description
subclass of: Restriction
  max cardinality: 1
  on property: linkId
subclass of: Restriction
  all values from: Expression
  on property: criteria
subclass of: Restriction
  all values from: Reference
  on property: groupDefinition
subclass of: Restriction
  all values from: CodeableConcept
  on property: code

_numberOfInstances
type: ObjectProperty
comment: (Modified) ImagingStudy.series.numberOfInstances
comment: (Modified) ImagingStudy.numberOfInstances

PlanDefinitionActionComponent
type: Class
comment: PlanDefinitionActionComponent: An action or group of actions to be taken as part of the plan. For example, in clinical care, an action would be to prescribe a particular indicated medication, or perform a particular test as appropriate. In pharmaceutical quality, an action would be the test that needs to be performed on a drug product as defined in the quality specification.
subclass of: BackboneElement
subclass of:
  union of: Restriction
    all values from: canonical
    on property: definition
  union of: Restriction
    max cardinality: 1
    on property: definition
  union of: Restriction
    all values from: uri
    on property: definition
  union of: Restriction
    max cardinality: 1
    on property: definition
subclass of: Restriction
  max cardinality: 1
  on property: type
subclass of: Restriction
  max cardinality: 1
  on property: linkId
subclass of: Restriction
  max cardinality: 1
  on property: description
subclass of: Restriction
  all values from: CodeableConcept
  on property: reason
subclass of: Restriction
  all values from: markdown
  on property: textEquivalent
subclass of: Restriction
  max cardinality: 1
  on property: textEquivalent
subclass of: Restriction
  max cardinality: 1
  on property: groupingBehavior
subclass of: Restriction
  max cardinality: 1
  on property: location
subclass of: Restriction
  all values from: canonical
  on property: transform
subclass of:
  union of: Restriction
    all values from: CodeableConcept
    on property: subject
  union of: Restriction
    max cardinality: 1
    on property: subject
  union of: Restriction
    all values from: Reference
    on property: subject
  union of: Restriction
    max cardinality: 1
    on property: subject
  union of: Restriction
    all values from: canonical
    on property: subject
  union of: Restriction
    max cardinality: 1
    on property: subject
subclass of: Restriction
  max cardinality: 1
  on property: selectionBehavior
subclass of: Restriction
  max cardinality: 1
  on property: priority
subclass of: Restriction
  all values from: PlanDefinitionActionConditionComponent
  on property: condition
subclass of: Restriction
  all values from: PlanDefinitionActionComponentAction
  on property: action
subclass of: Restriction
  all values from: code
  on property: groupingBehavior
subclass of: Restriction
  all values from: string
  on property: linkId
subclass of: Restriction
  max cardinality: 1
  on property: title
subclass of: Restriction
  all values from: PlanDefinitionActionDynamicValueComponent
  on property: dynamicValue
subclass of: Restriction
  all values from: id
  on property: goalId
subclass of: Restriction
  all values from: string
  on property: prefix
subclass of: Restriction
  all values from: CodeableConcept
  on property: type
subclass of: Restriction
  all values from: RelatedArtifact
  on property: documentation
subclass of: Restriction
  max cardinality: 1
  on property: prefix
subclass of: Restriction
  all values from: PlanDefinitionActionRelatedActionComponent
  on property: relatedAction
subclass of: Restriction
  all values from: PlanDefinitionActionInputComponent
  on property: input
subclass of: Restriction
  max cardinality: 1
  on property: requiredBehavior
subclass of: Restriction
  all values from: CodeableConcept
  on property: code
subclass of: Restriction
  all values from: markdown
  on property: description
subclass of: Restriction
  all values from: string
  on property: title
subclass of: Restriction
  max cardinality: 1
  on property: cardinalityBehavior
subclass of: Restriction
  all values from: code
  on property: priority
subclass of: Restriction
  max cardinality: 1
  on property: transform
subclass of: Restriction
  all values from: code
  on property: precheckBehavior
subclass of: Restriction
  all values from: TriggerDefinition
  on property: trigger
subclass of: Restriction
  all values from: code
  on property: cardinalityBehavior
subclass of: Restriction
  all values from: code
  on property: requiredBehavior
subclass of: Restriction
  all values from: PlanDefinitionActionParticipantComponent
  on property: participant
subclass of: Restriction
  all values from: PlanDefinitionActionOutputComponent
  on property: output
subclass of: Restriction
  max cardinality: 1
  on property: code
subclass of:
  union of: Restriction
    all values from: Age
    on property: timing
  union of: Restriction
    max cardinality: 1
    on property: timing
  union of: Restriction
    all values from: Duration
    on property: timing
  union of: Restriction
    max cardinality: 1
    on property: timing
  union of: Restriction
    all values from: Range
    on property: timing
  union of: Restriction
    max cardinality: 1
    on property: timing
  union of: Restriction
    all values from: Timing
    on property: timing
  union of: Restriction
    max cardinality: 1
    on property: timing
subclass of: Restriction
  all values from: CodeableReference
  on property: location
subclass of: Restriction
  all values from: code
  on property: selectionBehavior
subclass of: Restriction
  max cardinality: 1
  on property: precheckBehavior

_processor
type: ObjectProperty
comment: (Modified) PaymentReconciliation.processor

actualNumber
type: ObjectProperty
comment: ResearchStudy.recruitment.actualNumber: Actual total number of participants enrolled in study.
modifierExtensionProperty: _actualNumber
title: ResearchStudy.recruitment.actualNumber: Actual total number of participants enrolled in study

_network
type: ObjectProperty
comment: (Modified) AuditEvent.agent.network
comment: (Modified) ExplanationOfBenefit.benefitBalance.network
comment: (Modified) AuditEvent.entity.agent.network
comment: (Modified) InsurancePlan.network
comment: (Modified) Coverage.costToBeneficiary.network
comment: (Modified) OrganizationAffiliation.network
comment: (Modified) CoverageEligibilityResponse.insurance.item.network
comment: (Modified) Coverage.network
comment: (Modified) InsurancePlan.plan.network
comment: (Modified) InsurancePlan.coverage.network

effective
type: ObjectProperty
comment: Observation.effective
comment: MedicationStatement.effective
comment: DiagnosticReport.effective
comment: ClinicalImpression.effective
modifierExtensionProperty: effective

textEquivalent
type: ObjectProperty
comment: RequestOrchestration.action.textEquivalent: A text equivalent of the action to be performed. This provides a human-interpretable description of the action when the definition is consumed by a system that might not be capable of interpreting it dynamically.
comment: PlanDefinition.action.action.textEquivalent: A text equivalent of the action to be performed. This provides a human-interpretable description of the action when the definition is consumed by a system that might not be capable of interpreting it dynamically.
comment: PlanDefinition.action.textEquivalent: A text equivalent of the action to be performed. This provides a human-interpretable description of the action when the definition is consumed by a system that might not be capable of interpreting it dynamically.
comment: RequestOrchestration.action.action.textEquivalent: A text equivalent of the action to be performed. This provides a human-interpretable description of the action when the definition is consumed by a system that might not be capable of interpreting it dynamically.
modifierExtensionProperty: textEquivalent
title: RequestOrchestration.action.action.textEquivalent: Static text equivalent of the action, used if the dynamic aspects cannot be interpreted by the receiving system
title: PlanDefinition.action.textEquivalent: Static text equivalent of the action, used if the dynamic aspects cannot be interpreted by the receiving system
title: RequestOrchestration.action.textEquivalent: Static text equivalent of the action, used if the dynamic aspects cannot be interpreted by the receiving system
title: PlanDefinition.action.action.textEquivalent: Static text equivalent of the action, used if the dynamic aspects cannot be interpreted by the receiving system

preferred
type: ObjectProperty
comment: RelatedPerson.communication.preferred: Indicates whether or not the related person prefers this language (over other languages he or she masters up a certain level).
comment: SubstanceDefinition.name.translation.preferred: If this is the preferred name for this substance.
comment: Practitioner.communication.preferred: Indicates whether or not the person prefers this language (over other languages he masters up a certain level).
comment: SubstanceDefinition.name.synonym.preferred: If this is the preferred name for this substance.
comment: Patient.communication.preferred: Indicates whether or not the patient prefers this language (over other languages he masters up a certain level).
comment: SubstanceDefinition.name.preferred: If this is the preferred name for this substance.
comment: Person.communication.preferred: Indicates whether or not the person prefers this language (over other languages he masters up a certain level).
comment: NamingSystem.uniqueId.preferred: Indicates whether this identifier is the "preferred" identifier of this type.
modifierExtensionProperty: preferred
title: SubstanceDefinition.name.preferred: If this is the preferred name for this substance
title: Patient.communication.preferred: Language preference indicator
title: SubstanceDefinition.name.translation.preferred: If this is the preferred name for this substance
title: Person.communication.preferred: Language preference indicator
title: RelatedPerson.communication.preferred: Language preference indicator
title: SubstanceDefinition.name.synonym.preferred: If this is the preferred name for this substance
title: NamingSystem.uniqueId.preferred: Is this the id that should be used for this type
title: Practitioner.communication.preferred: Language preference indicator

ImplementationGuide
type: Class
comment: A set of rules of how a particular interoperability or standards problem is solved - typically through the use of FHIR resources. This resource is used to gather all the parts of an implementation guide into a logical whole and to publish a computable definition of all the parts.
subclass of: conformance.misc
subclass of: CanonicalResource
subclass of: Restriction
  all values from: boolean
  on property: experimental
subclass of: Restriction
  min cardinality: 1
  on property: fhirVersion
subclass of: Restriction
  max cardinality: 1
  on property: manifest
subclass of: Restriction
  all values from: ImplementationGuideDependsOnComponent
  on property: dependsOn
subclass of: Restriction
  all values from: code
  on property: status
subclass of: Restriction
  all values from: CodeableConcept
  on property: jurisdiction
subclass of: Restriction
  max cardinality: 1
  on property: title
subclass of:
  union of: Restriction
    all values from: string
    on property: versionAlgorithm
  union of: Restriction
    max cardinality: 1
    on property: versionAlgorithm
  union of: Restriction
    all values from: Coding
    on property: versionAlgorithm
  union of: Restriction
    max cardinality: 1
    on property: versionAlgorithm
subclass of: Restriction
  cardinality: 1
  on property: name
subclass of: Restriction
  max cardinality: 1
  on property: description
subclass of: Restriction
  all values from: UsageContext
  on property: useContext
subclass of: Restriction
  all values from: string
  on property: name
subclass of: Restriction
  all values from: ImplementationGuideDefinitionComponent
  on property: definition
subclass of: Restriction
  all values from: string
  on property: title
subclass of: Restriction
  max cardinality: 1
  on property: experimental
subclass of: Restriction
  all values from: code
  on property: license
subclass of: Restriction
  cardinality: 1
  on property: url
subclass of: Restriction
  all values from: ContactDetail
  on property: contact
subclass of: Restriction
  all values from: string
  on property: version
subclass of: Restriction
  max cardinality: 1
  on property: definition
subclass of: Restriction
  max cardinality: 1
  on property: date
subclass of: Restriction
  max cardinality: 1
  on property: copyrightLabel
subclass of: Restriction
  all values from: markdown
  on property: copyright
subclass of: Restriction
  all values from: id
  on property: packageId
subclass of: Restriction
  all values from: markdown
  on property: purpose
subclass of: Restriction
  all values from: dateTime
  on property: date
subclass of: Restriction
  max cardinality: 1
  on property: publisher
subclass of: Restriction
  cardinality: 1
  on property: status
subclass of: Restriction
  max cardinality: 1
  on property: copyright
subclass of: Restriction
  all values from: uri
  on property: url
subclass of: Restriction
  max cardinality: 1
  on property: version
subclass of: Restriction
  all values from: ImplementationGuideManifestComponent
  on property: manifest
subclass of: Restriction
  all values from: Identifier
  on property: identifier
subclass of: Restriction
  cardinality: 1
  on property: packageId
subclass of: Restriction
  all values from: string
  on property: copyrightLabel
subclass of: Restriction
  all values from: string
  on property: publisher
subclass of: Restriction
  max cardinality: 1
  on property: license
subclass of: Restriction
  all values from: markdown
  on property: description
subclass of: Restriction
  all values from: code
  on property: fhirVersion
subclass of: Restriction
  all values from: ImplementationGuideGlobalComponent
  on property: global
subclass of: Restriction
  max cardinality: 1
  on property: purpose

EvidenceReportRelatesToTargetComponent
type: Class
comment: EvidenceReportRelatesToComponent.EvidenceReportRelatesToTargetComponent: The target composition/document of this relationship.
subclass of: BackboneElement
subclass of: Restriction
  all values from: Reference
  on property: resource
subclass of: Restriction
  all values from: Identifier
  on property: identifier
subclass of: Restriction
  all values from: markdown
  on property: display
subclass of: Restriction
  max cardinality: 1
  on property: resource
subclass of: Restriction
  max cardinality: 1
  on property: url
subclass of: Restriction
  max cardinality: 1
  on property: identifier
subclass of: Restriction
  max cardinality: 1
  on property: display
subclass of: Restriction
  all values from: uri
  on property: url

_applicability
type: ObjectProperty
comment: (Modified) InsurancePlan.plan.specificCost.benefit.cost.applicability
comment: (Modified) ClinicalUseDefinition.indication.applicability
comment: (Modified) ClinicalUseDefinition.contraindication.applicability
comment: (Modified) ChargeItemDefinition.propertyGroup.applicability
comment: (Modified) ChargeItemDefinition.applicability

min
type: ObjectProperty
comment: GraphDefinition.link.min: Minimum occurrences for this link.
comment: ParameterDefinition.min: The minimum number of times this parameter SHALL appear in the request or response.
comment: ElementDefinition.base.min: Minimum cardinality of the base element identified by the path.
comment: OperationDefinition.parameter.min: The minimum number of times this parameter SHALL appear in the request or response.
comment: ElementDefinition.min: The minimum number of times this element SHALL appear in the instance.
comment: MessageDefinition.focus.min: Identifies the minimum number of resources of this type that must be pointed to by a message in order for it to be valid against this MessageDefinition.
comment: StructureMap.group.rule.source.min: Specified minimum cardinality for the element. This is optional; if present, it acts an implicit check on the input content.
comment: StructureMap.group.rule.rule.source.min: Specified minimum cardinality for the element. This is optional; if present, it acts an implicit check on the input content.
comment: OperationDefinition.parameter.part.min: The minimum number of times this parameter SHALL appear in the request or response.
modifierExtensionProperty: min
title: OperationDefinition.parameter.min: Minimum Cardinality
title: StructureMap.group.rule.rule.source.min: Specified minimum cardinality
title: MessageDefinition.focus.min: Minimum number of focuses of this type
title: ElementDefinition.base.min: Min cardinality of the base element
title: ParameterDefinition.min: Minimum cardinality
title: ElementDefinition.min: Minimum Cardinality
title: StructureMap.group.rule.source.min: Specified minimum cardinality
title: OperationDefinition.parameter.part.min: Minimum Cardinality
title: GraphDefinition.link.min: Minimum occurrences for this link

DeviceNameComponent
type: Class
comment: DeviceNameComponent: This represents the manufacturer's name of the device as provided by the device, from a UDI label, or by a person describing the Device. This typically would be used when a person provides the name(s) or when the device represents one of the names available from DeviceDefinition.
subclass of: BackboneElement
subclass of: Restriction
  all values from: boolean
  on property: display
subclass of: Restriction
  cardinality: 1
  on property: value
subclass of: Restriction
  all values from: string
  on property: value
subclass of: Restriction
  all values from: code
  on property: type
subclass of: Restriction
  max cardinality: 1
  on property: display
subclass of: Restriction
  cardinality: 1
  on property: type

Payment
type: Class
comment: ClaimResponse.Payment: Payment details for the adjudication of the claim.
comment: ExplanationOfBenefit.Payment: Payment details for the adjudication of the claim.
subclass of: BackboneElement
subclass of: Restriction
  max cardinality: 1
  on property: identifier
subclass of: Restriction
  cardinality: 1
  on property: amount
subclass of: Restriction
  max cardinality: 1
  on property: date
subclass of: Restriction
  all values from: Money
  on property: adjustment
subclass of: Restriction
  all values from: date
  on property: date
subclass of: Restriction
  all values from: Identifier
  on property: identifier
subclass of: Restriction
  max cardinality: 1
  on property: adjustment
subclass of: Restriction
  max cardinality: 1
  on property: adjustment
subclass of: Restriction
  all values from: CodeableConcept
  on property: adjustmentReason
subclass of: Restriction
  all values from: CodeableConcept
  on property: type
subclass of: Restriction
  max cardinality: 1
  on property: adjustmentReason
subclass of: Restriction
  all values from: Money
  on property: adjustment
subclass of: Restriction
  all values from: CodeableConcept
  on property: type
subclass of: Restriction
  max cardinality: 1
  on property: identifier
subclass of: Restriction
  all values from: Money
  on property: amount
subclass of: Restriction
  max cardinality: 1
  on property: amount
subclass of: Restriction
  max cardinality: 1
  on property: type
subclass of: Restriction
  cardinality: 1
  on property: type
subclass of: Restriction
  all values from: Identifier
  on property: identifier
subclass of: Restriction
  all values from: CodeableConcept
  on property: adjustmentReason
subclass of: Restriction
  all values from: Money
  on property: amount
subclass of: Restriction
  max cardinality: 1
  on property: date
subclass of: Restriction
  all values from: date
  on property: date
subclass of: Restriction
  max cardinality: 1
  on property: adjustmentReason

organismName
type: ObjectProperty
comment: SubstanceSourceMaterial.organismName: The organism accepted Scientific name shall be provided based on the organism taxonomy.
modifierExtensionProperty: organismName
title: SubstanceSourceMaterial.organismName: The organism accepted Scientific name shall be provided based on the organism taxonomy

relative
type: ObjectProperty
comment: MolecularSequence.relative: A sequence defined relative to another sequence.
modifierExtensionProperty: _relative
title: MolecularSequence.relative: A sequence defined relative to another sequence

Ratio
type: Class
comment: A relationship of two Quantity values - expressed as a numerator and a denominator.
subclass of: DataType
subclass of: Restriction
  max cardinality: 1
  on property: denominator
subclass of: Restriction
  all values from: SimpleQuantity
  on property: denominator
subclass of: Restriction
  max cardinality: 1
  on property: numerator
subclass of: Restriction
  all values from: Quantity
  on property: numerator
title: A ratio of two Quantity values - a numerator and a denominator

item
type: ObjectProperty
comment: ExplanationOfBenefit.item: A claim line. Either a simple (a product or service) or a 'group' of details which can also be a simple items or groups of sub-details.
comment: NutritionProduct.ingredient.item: The ingredient contained in the product.
comment: CoverageEligibilityResponse.insurance.item: Benefits and optionally current balances, and authorization details by category or service.
comment: QuestionnaireResponse.item.item: Sub-questions, sub-groups or display items nested beneath a group.
comment: MedicationKnowledge.definitional.ingredient.item: A reference to the resource that provides information about the ingredient.
comment: Questionnaire.item.item: Text, questions and other groups to be nested beneath a question or group.
comment: SupplyDelivery.suppliedItem.item
comment: QuestionnaireResponse.item.item.answer.item: Nested groups and/or questions found within this particular answer.
comment: InventoryReport.inventoryListing.item.item: The code or reference to the item type.
comment: AdverseEvent.mitigatingAction.item
comment: Linkage.item: Identifies which record considered as the reference to the same real-world occurrence as well as how the items should be evaluated within the collection of linked items.
comment: SupplyRequest.item: The item that is requested to be supplied. This is either a link to a resource representing the details of the item or a code that identifies the item from a known list.
comment: QuestionnaireResponse.item.answer.item.answer.item: Nested groups and/or questions found within this particular answer.
comment: PackagedProductDefinition.packaging.containedItem.item: The actual item(s) of medication, as manufactured, or a device (typically, but not necessarily, a co-packaged one), or other medically related item (such as food, biologicals, raw materials, medical fluids, gases etc.), as contained in the package. This also allows another whole packaged product to be included, which is solely for the case where a package of other entire packages is wanted - such as a wholesale or distribution pack (for layers within one package, use PackagedProductDefinition.packaging.packaging).
comment: QuestionnaireResponse.item.answer.item: Nested groups and/or questions found within this particular answer.
comment: Questionnaire.item.item.item: Text, questions and other groups to be nested beneath a question or group.
comment: Questionnaire.item: A particular question, question grouping or display text that is part of the questionnaire.
comment: CoverageEligibilityRequest.item: Service categories or billable services for which benefit details and/or an authorization prior to service delivery may be required by the payor.
comment: AdverseEvent.contributingFactor.item
comment: PackagedProductDefinition.packaging.packaging.containedItem.item: The actual item(s) of medication, as manufactured, or a device (typically, but not necessarily, a co-packaged one), or other medically related item (such as food, biologicals, raw materials, medical fluids, gases etc.), as contained in the package. This also allows another whole packaged product to be included, which is solely for the case where a package of other entire packages is wanted - such as a wholesale or distribution pack (for layers within one package, use PackagedProductDefinition.packaging.packaging).
comment: QuestionnaireResponse.item: A group or question item from the original questionnaire for which answers are provided.
comment: NutritionProduct.nutrient.item: The (relevant) nutrients in the product.
comment: InventoryReport.inventoryListing.item: The item or items in this listing.
comment: QuestionnaireResponse.item.item.item: Sub-questions, sub-groups or display items nested beneath a group.
comment: AdverseEvent.supportingInfo.item
comment: ClaimResponse.item: A claim line. Either a simple (a product or service) or a 'group' of details which can also be a simple items or groups of sub-details.
comment: ClinicalUseDefinition.interaction.interactant.item
comment: Claim.item: A claim line. Either a simple product or service or a 'group' of details which can each be a simple items or groups of sub-details.
comment: Medication.ingredient.item: The ingredient (substance or medication) that the ingredient.strength relates to. This is represented as a concept from a code system or described in another resource (Substance or Medication).
comment: AdverseEvent.preventiveAction.item
comment: QuestionnaireResponse.item.answer.item.item: Sub-questions, sub-groups or display items nested beneath a group.
comment: List.entry.item: A reference to the actual resource from which data was derived.
comment: ClinicalImpression.finding.item: Specific text, code or reference for finding or diagnosis, which may include ruled-out or resolved conditions.
modifierExtensionProperty: item
title: Questionnaire.item.item.item: Nested questionnaire items
title: QuestionnaireResponse.item.item: Child items of group item
title: ExplanationOfBenefit.item: Product or service provided
title: List.entry.item: Actual entry
title: QuestionnaireResponse.item.answer.item: Child items of question
title: PackagedProductDefinition.packaging.containedItem.item: The actual item(s) of medication, as manufactured, or a device, or other medically related item (food, biologicals, raw materials, medical fluids, gases etc.), as contained in the package
title: InventoryReport.inventoryListing.item: The item or items in this listing
title: QuestionnaireResponse.item.answer.item.answer.item: Child items of question
title: NutritionProduct.ingredient.item: The ingredient contained in the product
title: SupplyRequest.item: Medication, Substance, or Device requested to be supplied
title: Claim.item: Product or service provided
title: QuestionnaireResponse.item: Groups and questions
title: Questionnaire.item: Questions and sections within the Questionnaire
title: ClaimResponse.item: Adjudication for claim line items
title: QuestionnaireResponse.item.answer.item.item: Child items of group item
title: Questionnaire.item.item: Nested questionnaire items
title: PackagedProductDefinition.packaging.packaging.containedItem.item: The actual item(s) of medication, as manufactured, or a device, or other medically related item (food, biologicals, raw materials, medical fluids, gases etc.), as contained in the package
title: InventoryReport.inventoryListing.item.item: The code or reference to the item type
title: QuestionnaireResponse.item.item.item: Child items of group item
title: MedicationKnowledge.definitional.ingredient.item: Substances contained in the medication
title: CoverageEligibilityResponse.insurance.item: Benefits and authorization details
title: QuestionnaireResponse.item.item.answer.item: Child items of question
title: NutritionProduct.nutrient.item: The (relevant) nutrients in the product
title: Linkage.item: Item to be linked
title: Medication.ingredient.item: The ingredient (substance or medication) that the ingredient.strength relates to
title: ClinicalImpression.finding.item: What was found
title: CoverageEligibilityRequest.item: Item to be evaluated for eligibiity

rating
type: ObjectProperty
comment: Evidence.certainty.subcomponent.rating: Assessment or judgement of the aspect.
comment: Evidence.certainty.rating: Assessment or judgement of the aspect.
modifierExtensionProperty: _rating
title: Evidence.certainty.subcomponent.rating: Assessment or judgement of the aspect
title: Evidence.certainty.rating: Assessment or judgement of the aspect

_numerator
type: ObjectProperty
comment: (Modified) Ratio.numerator

TestScriptScopeComponent
type: Class
comment: TestScriptScopeComponent: The scope indicates a conformance artifact that is tested by the test(s) within this test case and the expectation of the test outcome(s) as well as the intended test phase inclusion.
subclass of: BackboneElement
subclass of: Restriction
  all values from: canonical
  on property: artifact
subclass of: Restriction
  max cardinality: 1
  on property: conformance
subclass of: Restriction
  all values from: CodeableConcept
  on property: conformance
subclass of: Restriction
  all values from: CodeableConcept
  on property: phase
subclass of: Restriction
  max cardinality: 1
  on property: phase
subclass of: Restriction
  cardinality: 1
  on property: artifact

_aggregation
type: ObjectProperty
comment: (Modified) ElementDefinition.type.aggregation

minutesDuration
type: ObjectProperty
comment: Appointment.minutesDuration: Number of minutes that the appointment is to take. This can be less than the duration between the start and end times. For example, where the actual time of appointment is only an estimate or if a 30 minute appointment is being requested, but any time would work. Also, if there is, for example, a planned 15 minute break in the middle of a long appointment, the duration may be 15 minutes less than the difference between the start and end.
modifierExtensionProperty: _minutesDuration
title: Appointment.minutesDuration: Can be less than start/end (e.g. estimate)

AuditEventEntityComponent
type: Class
comment: AuditEventEntityComponent: Specific instances of data or objects that have been accessed.
subclass of: BackboneElement
subclass of: Restriction
  max cardinality: 1
  on property: role
subclass of: Restriction
  all values from: AuditEventEntityComponentAgent
  on property: agent
subclass of: Restriction
  all values from: base64Binary
  on property: query
subclass of: Restriction
  max cardinality: 1
  on property: what
subclass of: Restriction
  all values from: AuditEventEntityDetailComponent
  on property: detail
subclass of: Restriction
  all values from: CodeableConcept
  on property: securityLabel
subclass of: Restriction
  max cardinality: 1
  on property: query
subclass of: Restriction
  all values from: Reference
  on property: what
subclass of: Restriction
  all values from: CodeableConcept
  on property: role

rate
type: ObjectProperty
comment: NutritionOrder.enteralFormula.administration.rate
comment: NutritionIntake.consumedItem.rate: Rate at which enteral feeding was administered.
comment: MedicationAdministration.dosage.rate
comment: Dosage.doseAndRate.rate
modifierExtensionProperty: rate
title: NutritionIntake.consumedItem.rate: Rate at which enteral feeding was administered

CompartmentDefinition
type: Class
comment: A compartment definition that defines how resources are accessed on a server.
subclass of: CanonicalResource
subclass of: conformance.behavior
subclass of: Restriction
  cardinality: 1
  on property: url
subclass of: Restriction
  max cardinality: 1
  on property: purpose
subclass of: Restriction
  all values from: string
  on property: title
subclass of: Restriction
  all values from: boolean
  on property: search
subclass of: Restriction
  max cardinality: 1
  on property: publisher
subclass of: Restriction
  max cardinality: 1
  on property: version
subclass of: Restriction
  all values from: markdown
  on property: description
subclass of: Restriction
  all values from: CompartmentDefinitionResourceComponent
  on property: resource
subclass of: Restriction
  cardinality: 1
  on property: status
subclass of: Restriction
  all values from: string
  on property: publisher
subclass of: Restriction
  all values from: boolean
  on property: experimental
subclass of: Restriction
  max cardinality: 1
  on property: title
subclass of: Restriction
  all values from: uri
  on property: url
subclass of: Restriction
  all values from: string
  on property: version
subclass of: Restriction
  max cardinality: 1
  on property: date
subclass of: Restriction
  all values from: markdown
  on property: purpose
subclass of: Restriction
  max cardinality: 1
  on property: description
subclass of: Restriction
  cardinality: 1
  on property: code
subclass of: Restriction
  max cardinality: 1
  on property: experimental
subclass of: Restriction
  all values from: code
  on property: code
subclass of: Restriction
  all values from: ContactDetail
  on property: contact
subclass of: Restriction
  all values from: code
  on property: status
subclass of: Restriction
  all values from: UsageContext
  on property: useContext
subclass of: Restriction
  all values from: dateTime
  on property: date
subclass of: Restriction
  cardinality: 1
  on property: search
subclass of: Restriction
  cardinality: 1
  on property: name
subclass of: Restriction
  all values from: string
  on property: name
subclass of:
  union of: Restriction
    all values from: string
    on property: versionAlgorithm
  union of: Restriction
    max cardinality: 1
    on property: versionAlgorithm
  union of: Restriction
    all values from: Coding
    on property: versionAlgorithm
  union of: Restriction
    max cardinality: 1
    on property: versionAlgorithm

renderedDosageInstruction
type: ObjectProperty
comment: MedicationStatement.renderedDosageInstruction: The full representation of the dose of the medication included in all dosage instructions. To be used when multiple dosage instructions are included to represent complex dosing such as increasing or tapering doses.
comment: MedicationRequest.renderedDosageInstruction: The full representation of the dose of the medication included in all dosage instructions. To be used when multiple dosage instructions are included to represent complex dosing such as increasing or tapering doses.
comment: MedicationDispense.renderedDosageInstruction: The full representation of the dose of the medication included in all dosage instructions. To be used when multiple dosage instructions are included to represent complex dosing such as increasing or tapering doses.
modifierExtensionProperty: _renderedDosageInstruction
title: MedicationStatement.renderedDosageInstruction: Full representation of the dosage instructions
title: MedicationRequest.renderedDosageInstruction: Full representation of the dosage instructions
title: MedicationDispense.renderedDosageInstruction: Full representation of the dosage instructions

methodType
type: ObjectProperty
comment: GenomicStudy.analysis.methodType: Type of the methods used in the analysis, e.g., Fluorescence in situ hybridization (FISH), Karyotyping, or Microsatellite instability testing (MSI).
modifierExtensionProperty: _methodType
title: GenomicStudy.analysis.methodType: Type of the methods used in the analysis (e.g., FISH, Karyotyping, MSI)

parent
type: ObjectProperty
comment: MessageDefinition.parent: Identifies a protocol or workflow that this MessageDefinition represents a step in.
comment: BiologicallyDerivedProduct.parent: Parent product (if any) for this biologically-derived product.
comment: Device.parent: The higher level or encompassing device that this device is a logical part of.
comment: Requirements.statement.parent: A larger requirement that this requirement helps to refine and enable.
comment: RiskAssessment.parent: A reference to a resource that this risk assessment is part of, such as a Procedure.
comment: Specimen.parent: Reference to the parent (source) specimen which is used when the specimen was either derived from or a component of another specimen.
modifierExtensionProperty: _parent
title: Specimen.parent: Specimen from which this specimen originated
title: Device.parent: The higher level or encompassing device that this device is a logical part of
title: MessageDefinition.parent: Protocol/workflow this is part of
title: RiskAssessment.parent: Part of this occurrence
title: Requirements.statement.parent: A larger requirement that this requirement helps to refine and enable
title: BiologicallyDerivedProduct.parent: The parent biologically-derived product

sourceId
type: ObjectProperty
comment: OperationDefinition.parameter.referencedFrom.sourceId: The id of the element in the referencing resource that is expected to resolve to this resource.
comment: TestScript.test.action.assert.sourceId: Fixture to evaluate the XPath/JSONPath expression or the headerField against.
comment: TestScript.setup.action.assert.sourceId: Fixture to evaluate the XPath/JSONPath expression or the headerField against.
comment: TestScript.variable.sourceId: Fixture to evaluate the XPath/JSONPath expression or the headerField against within this variable.
comment: OperationDefinition.parameter.part.referencedFrom.sourceId: The id of the element in the referencing resource that is expected to resolve to this resource.
comment: GraphDefinition.link.sourceId: The source node for this link.
comment: TestScript.setup.action.operation.sourceId: The id of the fixture used as the body of a PUT or POST request.
comment: TestScript.teardown.action.operation.sourceId: The id of the fixture used as the body of a PUT or POST request.
comment: TestScript.test.action.operation.sourceId: The id of the fixture used as the body of a PUT or POST request.
modifierExtensionProperty: _sourceId
title: OperationDefinition.parameter.referencedFrom.sourceId: Element id of reference
title: TestScript.teardown.action.operation.sourceId: Fixture Id of body for PUT and POST requests
title: TestScript.test.action.assert.sourceId: Fixture Id of source expression or headerField
title: TestScript.setup.action.assert.sourceId: Fixture Id of source expression or headerField
title: TestScript.test.action.operation.sourceId: Fixture Id of body for PUT and POST requests
title: TestScript.variable.sourceId: Fixture Id of source expression or headerField within this variable
title: OperationDefinition.parameter.part.referencedFrom.sourceId: Element id of reference
title: GraphDefinition.link.sourceId: Source Node for this link
title: TestScript.setup.action.operation.sourceId: Fixture Id of body for PUT and POST requests

_requestedPeriod
type: ObjectProperty
comment: (Modified) Task.requestedPeriod
comment: (Modified) Appointment.requestedPeriod

_chromosome
type: ObjectProperty
comment: (Modified) MolecularSequence.relative.startingSequence.chromosome

isSubPotent
type: ObjectProperty
comment: MedicationAdministration.isSubPotent: An indication that the full dose was not administered.
modifierExtensionProperty: isSubPotent
title: MedicationAdministration.isSubPotent: Full dose was not administered

presentedForm
type: ObjectProperty
comment: DiagnosticReport.presentedForm: Rich text representation of the entire result as issued by the diagnostic service. Multiple formats are allowed but they SHALL be semantically equivalent.
modifierExtensionProperty: presentedForm
title: DiagnosticReport.presentedForm: Entire report as issued

repetitions
type: ObjectProperty
comment: Transport.restriction.repetitions: Indicates the number of times the requested action should occur.
comment: Task.restriction.repetitions: Indicates the number of times the requested action should occur.
modifierExtensionProperty: repetitions
title: Transport.restriction.repetitions: How many times to repeat
title: Task.restriction.repetitions: How many times to repeat

aggregate
type: ObjectProperty
comment: Account.balance.aggregate: Who is expected to pay this part of the balance.
modifierExtensionProperty: aggregate
title: Account.balance.aggregate: Who is expected to pay this part of the balance

EvidenceStatisticComponent
type: Class
comment: EvidenceStatisticComponent: Values and parameters for a single statistic.
subclass of: BackboneElement
subclass of: Restriction
  all values from: CodeableConcept
  on property: category
subclass of: Restriction
  all values from: Annotation
  on property: note
subclass of: Restriction
  all values from: unsignedInt
  on property: numberOfEvents
subclass of: Restriction
  max cardinality: 1
  on property: category
subclass of: Restriction
  all values from: markdown
  on property: description
subclass of: Restriction
  max cardinality: 1
  on property: numberAffected
subclass of: Restriction
  all values from: EvidenceStatisticModelCharacteristicComponent
  on property: modelCharacteristic
subclass of: Restriction
  all values from: unsignedInt
  on property: numberAffected
subclass of: Restriction
  max cardinality: 1
  on property: sampleSize
subclass of: Restriction
  max cardinality: 1
  on property: numberOfEvents
subclass of: Restriction
  max cardinality: 1
  on property: statisticType
subclass of: Restriction
  all values from: EvidenceStatisticSampleSizeComponent
  on property: sampleSize
subclass of: Restriction
  all values from: Quantity
  on property: quantity
subclass of: Restriction
  all values from: EvidenceStatisticAttributeEstimateComponent
  on property: attributeEstimate
subclass of: Restriction
  max cardinality: 1
  on property: quantity
subclass of: Restriction
  all values from: CodeableConcept
  on property: statisticType
subclass of: Restriction
  max cardinality: 1
  on property: description

ImplementationGuideDefinitionParameterComponent
type: Class
comment: ImplementationGuideDefinitionComponent.ImplementationGuideDefinitionParameterComponent: A set of parameters that defines how the implementation guide is built. The parameters are defined by the relevant tools that build the implementation guides.
subclass of: BackboneElement
subclass of: Restriction
  cardinality: 1
  on property: value
subclass of: Restriction
  all values from: string
  on property: value
subclass of: Restriction
  cardinality: 1
  on property: code
subclass of: Restriction
  all values from: Coding
  on property: code

CompositionEventComponent
type: Class
comment: CompositionEventComponent: The clinical service, such as a colonoscopy or an appendectomy, being documented.
subclass of: BackboneElement
subclass of: Restriction
  all values from: CodeableReference
  on property: detail
subclass of: Restriction
  max cardinality: 1
  on property: period
subclass of: Restriction
  all values from: Period
  on property: period

_NutritionOrder
type: Class
comment: (Modified) NutritionOrder
subclass of: DomainResource

TaskInputComponent
type: Class
comment: TaskInputComponent: Additional information that may be needed in the execution of the task.
subclass of: BackboneElement
subclass of: Restriction
  cardinality: 1
  on property: value
subclass of: Restriction
  all values from: Element
  on property: value
subclass of: Restriction
  cardinality: 1
  on property: type
subclass of: Restriction
  all values from: CodeableConcept
  on property: type

rule
type: ObjectProperty
comment: StructureMap.group.rule.rule: Rules contained in this rule.
comment: GraphDefinition.link.compartment.rule: identical | matching | different | no-rule | custom.
comment: Permission.rule: A set of rules.
comment: StructureMap.group.rule.rule.rule: Rules contained in this rule.
comment: Contract.rule: List of Computable Policy Rule Language Representations of this Contract.
comment: StructureMap.group.rule: Transform Rule from source to target.
sub property of: what
modifierExtensionProperty: rule
title: StructureMap.group.rule: Transform Rule from source to target
title: StructureMap.group.rule.rule: Rules contained in this rule
title: Contract.rule: Computable Contract Language
title: GraphDefinition.link.compartment.rule: identical | matching | different | custom
title: Permission.rule: Constraints to the Permission
title: StructureMap.group.rule.rule.rule: Rules contained in this rule

Specimen
type: Class
comment: A sample to be used for analysis.
subclass of: DomainResource
subclass of: clinical.diagnostics
subclass of: Restriction
  all values from: Reference
  on property: request
subclass of: Restriction
  all values from: Annotation
  on property: note
subclass of: Restriction
  all values from: SpecimenFeatureComponent
  on property: feature
subclass of: Restriction
  all values from: SpecimenContainerComponent
  on property: container
subclass of: Restriction
  all values from: code
  on property: status
subclass of: Restriction
  all values from: code
  on property: combined
subclass of: Restriction
  all values from: SpecimenProcessingComponent
  on property: processing
subclass of: Restriction
  max cardinality: 1
  on property: subject
subclass of: Restriction
  all values from: CodeableConcept
  on property: condition
subclass of: Restriction
  all values from: dateTime
  on property: receivedTime
subclass of: Restriction
  max cardinality: 1
  on property: type
subclass of: Restriction
  max cardinality: 1
  on property: accessionIdentifier
subclass of: Restriction
  all values from: Reference
  on property: parent
subclass of: Restriction
  max cardinality: 1
  on property: receivedTime
subclass of: Restriction
  max cardinality: 1
  on property: collection
subclass of: Restriction
  all values from: CodeableConcept
  on property: role
subclass of: Restriction
  max cardinality: 1
  on property: status
subclass of: Restriction
  all values from: Identifier
  on property: identifier
subclass of: Restriction
  max cardinality: 1
  on property: combined
subclass of: Restriction
  all values from: Reference
  on property: subject
subclass of: Restriction
  all values from: SpecimenCollectionComponent
  on property: collection
subclass of: Restriction
  all values from: Identifier
  on property: accessionIdentifier
subclass of: Restriction
  all values from: CodeableConcept
  on property: type
modifierExtensionClass: _Specimen

_MedicinalProductDefinition
type: Class
comment: (Modified) MedicinalProductDefinition
subclass of: DomainResource

OperationDefinition
type: Class
comment: A formal computable definition of an operation (on the RESTful interface) or a named query (using the search interaction).
subclass of: CanonicalResource
subclass of: conformance.behavior
subclass of: Restriction
  all values from: code
  on property: kind
subclass of: Restriction
  all values from: boolean
  on property: experimental
subclass of: Restriction
  all values from: string
  on property: name
subclass of: Restriction
  max cardinality: 1
  on property: inputProfile
subclass of: Restriction
  max cardinality: 1
  on property: title
subclass of: Restriction
  cardinality: 1
  on property: name
subclass of: Restriction
  all values from: markdown
  on property: comment
subclass of: Restriction
  all values from: boolean
  on property: type
subclass of: Restriction
  cardinality: 1
  on property: code
subclass of: Restriction
  all values from: code
  on property: resource
subclass of: Restriction
  all values from: string
  on property: title
subclass of: Restriction
  max cardinality: 1
  on property: outputProfile
subclass of: Restriction
  all values from: canonical
  on property: outputProfile
subclass of: Restriction
  max cardinality: 1
  on property: date
subclass of: Restriction
  max cardinality: 1
  on property: affectsState
subclass of: Restriction
  cardinality: 1
  on property: kind
subclass of: Restriction
  all values from: dateTime
  on property: date
subclass of: Restriction
  cardinality: 1
  on property: status
subclass of: Restriction
  max cardinality: 1
  on property: experimental
subclass of: Restriction
  max cardinality: 1
  on property: purpose
subclass of: Restriction
  max cardinality: 1
  on property: url
subclass of: Restriction
  all values from: Identifier
  on property: identifier
subclass of: Restriction
  all values from: CodeableConcept
  on property: jurisdiction
subclass of: Restriction
  all values from: ContactDetail
  on property: contact
subclass of: Restriction
  all values from: boolean
  on property: system
subclass of: Restriction
  all values from: canonical
  on property: inputProfile
subclass of: Restriction
  all values from: boolean
  on property: instance
subclass of: Restriction
  cardinality: 1
  on property: system
subclass of: Restriction
  max cardinality: 1
  on property: publisher
subclass of: Restriction
  max cardinality: 1
  on property: comment
subclass of: Restriction
  all values from: string
  on property: version
subclass of: Restriction
  max cardinality: 1
  on property: copyright
subclass of: Restriction
  all values from: boolean
  on property: affectsState
subclass of: Restriction
  cardinality: 1
  on property: type
subclass of: Restriction
  all values from: string
  on property: publisher
subclass of: Restriction
  max cardinality: 1
  on property: description
subclass of:
  union of: Restriction
    all values from: string
    on property: versionAlgorithm
  union of: Restriction
    max cardinality: 1
    on property: versionAlgorithm
  union of: Restriction
    all values from: Coding
    on property: versionAlgorithm
  union of: Restriction
    max cardinality: 1
    on property: versionAlgorithm
subclass of: Restriction
  all values from: string
  on property: copyrightLabel
subclass of: Restriction
  all values from: canonical
  on property: base
subclass of: Restriction
  all values from: OperationDefinitionOverloadComponent
  on property: overload
subclass of: Restriction
  max cardinality: 1
  on property: base
subclass of: Restriction
  all values from: code
  on property: code
subclass of: Restriction
  all values from: markdown
  on property: copyright
subclass of: Restriction
  all values from: OperationDefinitionParameterComponent
  on property: parameter
subclass of: Restriction
  all values from: uri
  on property: url
subclass of: Restriction
  max cardinality: 1
  on property: version
subclass of: Restriction
  max cardinality: 1
  on property: copyrightLabel
subclass of: Restriction
  cardinality: 1
  on property: instance
subclass of: Restriction
  all values from: markdown
  on property: description
subclass of: Restriction
  all values from: code
  on property: status
subclass of: Restriction
  all values from: markdown
  on property: purpose
subclass of: Restriction
  all values from: UsageContext
  on property: useContext

process
type: ObjectProperty
comment: ExampleScenario.process: A group of operations that represents a significant step within a scenario.
comment: ExampleScenario.process.step.process: Indicates that the step is a complex sub-process with its own steps.
comment: ExampleScenario.process.step.process.step.process: Indicates that the step is a complex sub-process with its own steps.
comment: ExampleScenario.process.step.alternative.step.process: Indicates that the step is a complex sub-process with its own steps.
comment: ExampleScenario.process.step.process.step.alternative.step.process: Indicates that the step is a complex sub-process with its own steps.
comment: ExampleScenario.process.step.alternative.step.process.step.process: Indicates that the step is a complex sub-process with its own steps.
modifierExtensionProperty: process
title: ExampleScenario.process.step.alternative.step.process.step.process: Step is nested process
title: ExampleScenario.process.step.alternative.step.process: Step is nested process
title: ExampleScenario.process: Major process within scenario
title: ExampleScenario.process.step.process: Step is nested process
title: ExampleScenario.process.step.process.step.alternative.step.process: Step is nested process
title: ExampleScenario.process.step.process.step.process: Step is nested process

CitationCitedArtifactContributorshipEntryContributionInstanceComponent
type: Class
comment: CitationCitedArtifactComponent.CitationCitedArtifactContributorshipComponent.CitationCitedArtifactContributorshipEntryComponent.CitationCitedArtifactContributorshipEntryContributionInstanceComponent: Contributions with accounting for time or number.
subclass of: BackboneElement
subclass of: Restriction
  max cardinality: 1
  on property: time
subclass of: Restriction
  all values from: dateTime
  on property: time
subclass of: Restriction
  cardinality: 1
  on property: type
subclass of: Restriction
  all values from: CodeableConcept
  on property: type

EncounterAdmissionComponent
type: Class
comment: EncounterAdmissionComponent: Details about the stay during which a healthcare service is provided. This does not describe the event of admitting the patient, but rather any information that is relevant from the time of admittance until the time of discharge.
subclass of: BackboneElement
subclass of: Restriction
  max cardinality: 1
  on property: origin
subclass of: Restriction
  max cardinality: 1
  on property: dischargeDisposition
subclass of: Restriction
  all values from: Reference
  on property: destination
subclass of: Restriction
  max cardinality: 1
  on property: reAdmission
subclass of: Restriction
  max cardinality: 1
  on property: admitSource
subclass of: Restriction
  max cardinality: 1
  on property: destination
subclass of: Restriction
  max cardinality: 1
  on property: preAdmissionIdentifier
subclass of: Restriction
  all values from: CodeableConcept
  on property: admitSource
subclass of: Restriction
  all values from: CodeableConcept
  on property: dischargeDisposition
subclass of: Restriction
  all values from: CodeableConcept
  on property: reAdmission
subclass of: Restriction
  all values from: Identifier
  on property: preAdmissionIdentifier
subclass of: Restriction
  all values from: Reference
  on property: origin

_MedicationDispense
type: Class
comment: (Modified) MedicationDispense
subclass of: DomainResource

translation
type: ObjectProperty
comment: SubstanceDefinition.name.synonym.translation: A translation for this name into another human language.
comment: SubstanceDefinition.name.translation.translation: A translation for this name into another human language.
comment: TerminologyCapabilities.translation: Information about the [ConceptMap/$translate](conceptmap-operation-translate.html) operation.
comment: SubstanceDefinition.name.translation: A translation for this name into another human language.
comment: TerminologyCapabilities.closure.translation: If cross-system closure is supported.
modifierExtensionProperty: translation
title: SubstanceDefinition.name.translation.translation: A translation for this name into another human language
title: SubstanceDefinition.name.translation: A translation for this name into another human language
title: SubstanceDefinition.name.synonym.translation: A translation for this name into another human language
title: TerminologyCapabilities.translation: Information about the [ConceptMap/$translate](conceptmap-operation-translate.html) operation
title: TerminologyCapabilities.closure.translation: If cross-system closure is supported

ObservationTriggeredByComponent
type: Class
comment: ObservationTriggeredByComponent: Identifies the observation(s) that triggered the performance of this observation.
subclass of: BackboneElement
subclass of: Restriction
  max cardinality: 1
  on property: reason
subclass of: Restriction
  all values from: Reference
  on property: observation
subclass of: Restriction
  all values from: string
  on property: reason
subclass of: Restriction
  cardinality: 1
  on property: type
subclass of: Restriction
  all values from: code
  on property: type
subclass of: Restriction
  cardinality: 1
  on property: observation

_etag
type: ObjectProperty
comment: (Modified) Bundle.entry.response.etag

_dateCriterion
type: ObjectProperty
comment: (Modified) ImmunizationRecommendation.recommendation.dateCriterion

_administrationInstruction
type: ObjectProperty
comment: (Modified) NutritionOrder.enteralFormula.administrationInstruction

part
type: ObjectProperty
comment: OperationDefinition.parameter.part.part: The parts of a nested Parameter.
comment: MedicinalProductDefinition.name.part.part: A fragment of a product name.
comment: Citation.citedArtifact.part: The component of the article or artifact.
comment: OperationDefinition.parameter.part: The parts of a nested Parameter.
comment: MedicinalProductDefinition.name.part: Coding words or phrases of the name.
comment: Parameters.parameter.part: A named part of a multi-part parameter.
comment: SubstanceSourceMaterial.partDescription.part: Entity of anatomical origin of source material within an organism.
comment: Parameters.parameter.part.part: A named part of a multi-part parameter.
comment: SubstanceDefinition.sourceMaterial.part: An anatomical origin of the source material within an organism.
modifierExtensionProperty: part
title: Citation.citedArtifact.part: The component of the article or artifact
title: Parameters.parameter.part.part: Named part of a multi-part parameter
title: MedicinalProductDefinition.name.part: Coding words or phrases of the name
title: Parameters.parameter.part: Named part of a multi-part parameter
title: OperationDefinition.parameter.part: Parts of a nested Parameter
title: MedicinalProductDefinition.name.part.part: A fragment of a product name
title: SubstanceSourceMaterial.partDescription.part: Entity of anatomical origin of source material within an organism
title: SubstanceDefinition.sourceMaterial.part: An anatomical origin of the source material within an organism
title: OperationDefinition.parameter.part.part: Parts of a nested Parameter

_billablePeriod
type: ObjectProperty
comment: (Modified) ExplanationOfBenefit.billablePeriod
comment: (Modified) Claim.billablePeriod

requestHeader
type: ObjectProperty
comment: TestScript.teardown.action.operation.requestHeader: Header elements would be used to set HTTP headers.
comment: TestScript.test.action.operation.requestHeader: Header elements would be used to set HTTP headers.
comment: TestScript.setup.action.operation.requestHeader: Header elements would be used to set HTTP headers.
modifierExtensionProperty: requestHeader
title: TestScript.teardown.action.operation.requestHeader: Each operation can have one or more header elements
title: TestScript.test.action.operation.requestHeader: Each operation can have one or more header elements
title: TestScript.setup.action.operation.requestHeader: Each operation can have one or more header elements

_shortTitle
type: ObjectProperty
comment: (Modified) EvidenceVariable.shortTitle

_securityLabel
type: ObjectProperty
comment: (Modified) DocumentReference.securityLabel
comment: (Modified) Contract.term.group.securityLabel
comment: (Modified) Contract.term.securityLabel
comment: (Modified) Consent.provision.provision.securityLabel
comment: (Modified) Consent.provision.securityLabel
comment: (Modified) AuditEvent.entity.securityLabel

_procedure
type: ObjectProperty
comment: (Modified) ExplanationOfBenefit.procedure.procedure
comment: (Modified) Claim.procedure.procedure
comment: (Modified) ExplanationOfBenefit.procedure
comment: (Modified) Specimen.collection.procedure
comment: (Modified) ImagingStudy.procedure
comment: (Modified) Claim.procedure
comment: (Modified) FamilyMemberHistory.procedure
comment: (Modified) Account.procedure

periodMax
type: ObjectProperty
comment: Timing.repeat.periodMax: If present, indicates that the period is a range from [period] to [periodMax], allowing expressing concepts such as "do this once every 3-5 days.
modifierExtensionProperty: periodMax
title: Timing.repeat.periodMax: Upper limit of period (3-4 hours)

monograph
type: ObjectProperty
comment: MedicationKnowledge.monograph: Associated documentation about the medication.
modifierExtensionProperty: monograph
title: MedicationKnowledge.monograph: Associated documentation about the medication

_eventsSinceSubscriptionStart
type: ObjectProperty
comment: (Modified) SubscriptionStatus.eventsSinceSubscriptionStart

QuestionnaireResponseItemAnswerComponent
type: Class
comment: QuestionnaireResponseItemComponent.QuestionnaireResponseItemAnswerComponent: The respondent's answer(s) to the question.
comment: QuestionnaireResponseItemComponent.QuestionnaireResponseItemAnswerComponentItem.QuestionnaireResponseItemAnswerComponent: The respondent's answer(s) to the question.
comment: QuestionnaireResponseItemComponentItem.QuestionnaireResponseItemAnswerComponent: The respondent's answer(s) to the question.
subclass of: BackboneElement
subclass of: Restriction
  all values from: QuestionnaireResponseItemComponent.QuestionnaireResponseItemAnswerComponentItem.QuestionnaireResponseItemAnswerComponentItem
  on property: item
subclass of: Restriction
  all values from: QuestionnaireResponseItemComponent.QuestionnaireResponseItemAnswerComponentItem
  on property: item
subclass of:
  union of: Restriction
    all values from: boolean
    on property: value
  union of: Restriction
    cardinality: 1
    on property: value
  union of: Restriction
    all values from: decimal
    on property: value
  union of: Restriction
    cardinality: 1
    on property: value
  union of: Restriction
    all values from: integer
    on property: value
  union of: Restriction
    cardinality: 1
    on property: value
  union of: Restriction
    all values from: date
    on property: value
  union of: Restriction
    cardinality: 1
    on property: value
  union of: Restriction
    all values from: dateTime
    on property: value
  union of: Restriction
    cardinality: 1
    on property: value
  union of: Restriction
    all values from: time
    on property: value
  union of: Restriction
    cardinality: 1
    on property: value
  union of: Restriction
    all values from: string
    on property: value
  union of: Restriction
    cardinality: 1
    on property: value
  union of: Restriction
    all values from: uri
    on property: value
  union of: Restriction
    cardinality: 1
    on property: value
  union of: Restriction
    all values from: Attachment
    on property: value
  union of: Restriction
    cardinality: 1
    on property: value
  union of: Restriction
    all values from: Coding
    on property: value
  union of: Restriction
    cardinality: 1
    on property: value
  union of: Restriction
    all values from: SimpleQuantity
    on property: value
  union of: Restriction
    cardinality: 1
    on property: value
  union of: Restriction
    all values from: Reference
    on property: value
  union of: Restriction
    cardinality: 1
    on property: value
subclass of:
  union of: Restriction
    all values from: boolean
    on property: value
  union of: Restriction
    cardinality: 1
    on property: value
  union of: Restriction
    all values from: decimal
    on property: value
  union of: Restriction
    cardinality: 1
    on property: value
  union of: Restriction
    all values from: integer
    on property: value
  union of: Restriction
    cardinality: 1
    on property: value
  union of: Restriction
    all values from: date
    on property: value
  union of: Restriction
    cardinality: 1
    on property: value
  union of: Restriction
    all values from: dateTime
    on property: value
  union of: Restriction
    cardinality: 1
    on property: value
  union of: Restriction
    all values from: time
    on property: value
  union of: Restriction
    cardinality: 1
    on property: value
  union of: Restriction
    all values from: string
    on property: value
  union of: Restriction
    cardinality: 1
    on property: value
  union of: Restriction
    all values from: uri
    on property: value
  union of: Restriction
    cardinality: 1
    on property: value
  union of: Restriction
    all values from: Attachment
    on property: value
  union of: Restriction
    cardinality: 1
    on property: value
  union of: Restriction
    all values from: Coding
    on property: value
  union of: Restriction
    cardinality: 1
    on property: value
  union of: Restriction
    all values from: SimpleQuantity
    on property: value
  union of: Restriction
    cardinality: 1
    on property: value
  union of: Restriction
    all values from: Reference
    on property: value
  union of: Restriction
    cardinality: 1
    on property: value
subclass of:
  union of: Restriction
    all values from: boolean
    on property: value
  union of: Restriction
    cardinality: 1
    on property: value
  union of: Restriction
    all values from: decimal
    on property: value
  union of: Restriction
    cardinality: 1
    on property: value
  union of: Restriction
    all values from: integer
    on property: value
  union of: Restriction
    cardinality: 1
    on property: value
  union of: Restriction
    all values from: date
    on property: value
  union of: Restriction
    cardinality: 1
    on property: value
  union of: Restriction
    all values from: dateTime
    on property: value
  union of: Restriction
    cardinality: 1
    on property: value
  union of: Restriction
    all values from: time
    on property: value
  union of: Restriction
    cardinality: 1
    on property: value
  union of: Restriction
    all values from: string
    on property: value
  union of: Restriction
    cardinality: 1
    on property: value
  union of: Restriction
    all values from: uri
    on property: value

formatted
type: ObjectProperty
comment: MolecularSequence.formatted: Sequence that was observed as file content. Can be an actual file contents, or referenced by a URL to an external system.
modifierExtensionProperty: formatted
title: MolecularSequence.formatted: Embedded file or a link (URL) which contains content to represent the sequence

restoreDate
type: ObjectProperty
comment: MarketingStatus.restoreDate: The date when the Medicinal Product is placed on the market by the Marketing Authorization Holder (or where applicable, the manufacturer/distributor) in a country and/or jurisdiction shall be provided A complete date consisting of day, month and year shall be specified using the ISO 8601 date format NOTE “Placed on the market” refers to the release of the Medicinal Product into the distribution chain.
modifierExtensionProperty: restoreDate
title: MarketingStatus.restoreDate: The date when the Medicinal Product is placed on the market by the Marketing Authorization Holder (or where applicable, the manufacturer/distributor) in a country and/or jurisdiction shall be provided A complete date consisting of day, month and year shall be specified using the ISO 8601 date format NOTE “Placed on the market” refers to the release of the Medicinal Product into the distribution chain

_grouping
type: ObjectProperty
comment: (Modified) ImplementationGuide.definition.grouping

definition
type: ObjectProperty
comment: QuestionnaireResponse.item.definition: A reference to an [ElementDefinition](elementdefinition.html) that provides the details for the item.
comment: ImplementationGuide.definition: The information needed by an IG publisher tool to publish the whole implementation guide.
comment: CapabilityStatement.messaging.supportedMessage.definition: Points to a message definition that identifies the messaging event, message structure, allowed responses, etc.
comment: RequestOrchestration.action.action.definition
comment: Device.definition: The reference to the definition for the device.
comment: MedicationKnowledge.definitional.definition: Associated definitions for this medication.
comment: RequestOrchestration.action.definition
comment: PlanDefinition.action.action.definition
comment: QuestionnaireResponse.item.answer.item.definition: A reference to an [ElementDefinition](elementdefinition.html) that provides the details for the item.
comment: QuestionnaireResponse.item.item.definition: A reference to an [ElementDefinition](elementdefinition.html) that provides the details for the item.
comment: SearchParameter.component.definition: The definition of the search parameter that describes this part.
comment: CodeSystem.concept.definition: The formal definition of the concept. The code system resource does not make formal definitions required, because of the prevalence of legacy systems. However, they are highly recommended, as without them there is no formal meaning associated with the concept.
comment: Measure.term.definition: Provides a definition for the term as used within the measure.
comment: PlanDefinition.action.definition
comment: CapabilityStatement.rest.resource.operation.definition: Where the formal definition can be found. If a server references the base definition of an Operation (i.e. from the specification itself such as ```http://hl7.org/fhir/OperationDefinition/ValueSet-expand```), that means it supports the full capabilities of the operation - e.g. both GET and POST invocation. If it only supports a subset, it must define its own custom [OperationDefinition](operationdefinition.html#) with a 'base' of the original OperationDefinition. The custom definition would describe the specific subset of functionality supported.
comment: CapabilityStatement.rest.resource.searchParam.definition: An absolute URI that is a formal reference to where this parameter was first defined, so that a client can be confident of the meaning of the search parameter (a reference to [SearchParameter.url](searchparameter-definitions.html#SearchParameter.url)). This element SHALL be populated if the search parameter refers to a SearchParameter defined by the FHIR core specification or externally defined IGs.
comment: CapabilityStatement.rest.operation.definition: Where the formal definition can be found. If a server references the base definition of an Operation (i.e. from the specification itself such as ```http://hl7.org/fhir/OperationDefinition/ValueSet-expand```), that means it supports the full capabilities of the operation - e.g. both GET and POST invocation. If it only supports a subset, it must define its own custom [OperationDefinition](operationdefinition.html#) with a 'base' of the original OperationDefinition. The custom definition would describe the specific subset of functionality supported.
comment: CapabilityStatement.rest.searchParam.definition: An absolute URI that is a formal reference to where this parameter was first defined, so that a client can be confident of the meaning of the search parameter (a reference to [SearchParameter.url](searchparameter-definitions.html#SearchParameter.url)). This element SHALL be populated if the search parameter refers to a SearchParameter defined by the FHIR core specification or externally defined IGs.
comment: ConditionDefinition.definition: Formal definitions of the condition. These may be references to ontologies, published clinical protocols or research papers.
comment: ElementDefinition.definition: Provides a complete explanation of the meaning of the data element for human readability. For the case of elements derived from existing elements (e.g. constraints), the definition SHALL be consistent with the base definition, but convey the meaning of the element in the particular context of use of the resource. (Note: The text you are reading is specified in ElementDefinition.definition).
comment: MessageHeader.definition: Permanent link to the MessageDefinition for this message.
comment: Medication.definition: A reference to a knowledge resource that provides more information about this medication.
comment: CodeSystem.concept.concept.definition: The formal definition of the concept. The code system resource does not make formal definitions required, because of the prevalence of legacy systems. However, they are highly recommended, as without them there is no formal meaning associated with the concept.
comment: Questionnaire.item.item.definition: This element is a URI that refers to an [ElementDefinition](elementdefinition.html) or to an [ObservationDefinition](observationdefinition.html) that provides information about this item, including information that might otherwise be included in the instance of the Questionnaire resource. A detailed description of the construction of the URI is shown in [Comments](questionnaire.html#definition), below.
comment: Questionnaire.item.definition: This element is a URI that refers to an [ElementDefinition](elementdefinition.html) or to an [ObservationDefinition](observationdefinition.html) that provides information about this item, including information that might otherwise be included in the instance of the Questionnaire resource. A detailed description of the construction of the URI is shown in [Comments](questionnaire.html#definition), below.
modifierExtensionProperty: _definition
title: CodeSystem.concept.concept.definition: Formal definition
title: CapabilityStatement.rest.resource.operation.definition: The defined operation/query
title: CapabilityStatement.rest.resource.searchParam.definition: Source of definition for parameter
title: CapabilityStatement.messaging.supportedMessage.definition: Message supported by this system
title: QuestionnaireResponse.item.answer.item.definition: ElementDefinition - details for the item
title: ElementDefinition.definition: Full formal definition as narrative text
title: Questionnaire.item.definition: ElementDefinition - details for the item
title: Questionnaire.item.item.definition: ElementDefinition - details for the item
title: SearchParameter.component.definition: Defines how the part works
title: QuestionnaireResponse.item.item.definition: ElementDefinition - details for the item
title: Device.definition: The reference to the definition for the device
title: Medication.definition: Knowledge about this medication
title: MessageHeader.definition: Link to the definition for this message
title: Measure.term.definition: Meaning of the term
title: CapabilityStatement.rest.operation.definition: The defined operation/query
title: ImplementationGuide.definition: Information needed to build the IG
title: CapabilityStatement.rest.searchParam.definition: Source of definition for parameter
title: MedicationKnowledge.definitional.definition: Definitional resources that provide more information about this medication
title: CodeSystem.concept.definition: Formal definition
title: QuestionnaireResponse.item.definition: ElementDefinition - details for the item
title: ConditionDefinition.definition: Formal Definition for the condition

BodyStructureIncludedStructureBodyLandmarkOrientationDistanceFromLandmarkComponent
type: Class
comment: BodyStructureIncludedStructureBodyLandmarkOrientationComponent.BodyStructureIncludedStructureBodyLandmarkOrientationDistanceFromLandmarkComponent: The distance in centimeters a certain observation is made from a body landmark.
comment: BodyStructureIncludedStructureComponent.BodyStructureIncludedStructureBodyLandmarkOrientationComponent.BodyStructureIncludedStructureBodyLandmarkOrientationDistanceFromLandmarkComponent: The distance in centimeters a certain observation is made from a body landmark.
subclass of: BackboneElement
subclass of: Restriction
  all values from: Quantity
  on property: value
subclass of: Restriction
  all values from: CodeableReference
  on property: device
subclass of: Restriction
  all values from: Quantity
  on property: value
subclass of: Restriction
  all values from: CodeableReference
  on property: device

dayOfWeek
type: ObjectProperty
comment: Appointment.recurrenceTemplate.monthlyTemplate.dayOfWeek: Indicates which day of the week the recurring appointments should occur each nth week.
comment: Timing.repeat.dayOfWeek: If one or more days of week is provided, then the action happens only on the specified day(s).
modifierExtensionProperty: dayOfWeek
title: Appointment.recurrenceTemplate.monthlyTemplate.dayOfWeek: Indicates which day of the week the appointment should occur
title: Timing.repeat.dayOfWeek: mon | tue | wed | thu | fri | sat | sun

_variableDefinition
type: ObjectProperty
comment: (Modified) Evidence.statistic.modelCharacteristic.variable.variableDefinition
comment: (Modified) Evidence.variableDefinition

nodeRole
type: ObjectProperty
domain: Resource
range: treeRoot
title: Identifies role of subject in context of a given document

Permission
type: Class
comment: Permission resource holds access rules for a given data and context.
subclass of: DomainResource
subclass of: infrastructure.information
subclass of: Restriction
  max cardinality: 1
  on property: asserter
subclass of: Restriction
  cardinality: 1
  on property: combining
subclass of: Restriction
  cardinality: 1
  on property: status
subclass of: Restriction
  all values from: PermissionJustificationComponent
  on property: justification
subclass of: Restriction
  all values from: code
  on property: status
subclass of: Restriction
  all values from: dateTime
  on property: date
subclass of: Restriction
  max cardinality: 1
  on property: justification
subclass of: Restriction
  max cardinality: 1
  on property: validity
subclass of: Restriction
  all values from: Rule
  on property: rule
subclass of: Restriction
  all values from: code
  on property: combining
subclass of: Restriction
  all values from: Period
  on property: validity
subclass of: Restriction
  all values from: Reference
  on property: asserter
modifierExtensionClass: _Permission

dateWritten
type: ObjectProperty
comment: VisionPrescription.dateWritten: The date (and perhaps time) when the prescription was written.
sub property of: when.recorded
modifierExtensionProperty: dateWritten
title: VisionPrescription.dateWritten: When prescription was authorized

ratioHighLimitAmount
type: ObjectProperty
comment: SubstanceDefinition.relationship.ratioHighLimitAmount: For use when the numeric has an uncertain range.
modifierExtensionProperty: ratioHighLimitAmount
title: SubstanceDefinition.relationship.ratioHighLimitAmount: For use when the numeric has an uncertain range

_relatedData
type: ObjectProperty
comment: (Modified) PlanDefinition.action.output.relatedData
comment: (Modified) PlanDefinition.action.action.input.relatedData
comment: (Modified) RequestOrchestration.action.input.relatedData
comment: (Modified) PlanDefinition.action.input.relatedData
comment: (Modified) RequestOrchestration.action.output.relatedData
comment: (Modified) RequestOrchestration.action.action.output.relatedData
comment: (Modified) RequestOrchestration.action.action.input.relatedData
comment: (Modified) PlanDefinition.action.action.output.relatedData

_inforce
type: ObjectProperty
comment: (Modified) CoverageEligibilityResponse.insurance.inforce

_reportingVendor
type: ObjectProperty
comment: (Modified) MeasureReport.reportingVendor

_sequenceRange
type: ObjectProperty
comment: (Modified) MolecularSequence.relative.sequenceRange

member
type: ObjectProperty
comment: Group.member: Identifies the resource instances that are members of the group.
comment: CareTeam.participant.member: The specific person or organization who is participating/expected to participate in the care team.
sub property of: who.focus
sub property of: who.actor
modifierExtensionProperty: _member
title: Group.member: Who or what is in group
title: CareTeam.participant.member: Who is involved

_versionAlgorithm
type: ObjectProperty
comment: (Modified) Library.versionAlgorithm
comment: (Modified) ValueSet.versionAlgorithm
comment: (Modified) Questionnaire.versionAlgorithm
comment: (Modified) Requirements.versionAlgorithm
comment: (Modified) TestScript.versionAlgorithm
comment: (Modified) SubscriptionTopic.versionAlgorithm
comment: (Modified) CodeSystem.versionAlgorithm
comment: (Modified) SpecimenDefinition.versionAlgorithm
comment: (Modified) TerminologyCapabilities.versionAlgorithm
comment: (Modified) ConceptMap.versionAlgorithm
comment: (Modified) CompartmentDefinition.versionAlgorithm
comment: (Modified) StructureMap.versionAlgorithm
comment: (Modified) SearchParameter.versionAlgorithm
comment: (Modified) EventDefinition.versionAlgorithm
comment: (Modified) ObservationDefinition.versionAlgorithm
comment: (Modified) CanonicalResource.versionAlgorithm
comment: (Modified) StructureDefinition.versionAlgorithm
comment: (Modified) MessageDefinition.versionAlgorithm
comment: (Modified) PlanDefinition.versionAlgorithm
comment: (Modified) ExampleScenario.versionAlgorithm
comment: (Modified) NamingSystem.versionAlgorithm
comment: (Modified) ConditionDefinition.versionAlgorithm
comment: (Modified) Measure.versionAlgorithm
comment: (Modified) ActivityDefinition.versionAlgorithm
comment: (Modified) ChargeItemDefinition.versionAlgorithm
comment: (Modified) EvidenceVariable.versionAlgorithm
comment: (Modified) Evidence.versionAlgorithm
comment: (Modified) Citation.versionAlgorithm
comment: (Modified) GraphDefinition.versionAlgorithm
comment: (Modified) ActorDefinition.versionAlgorithm
comment: (Modified) TestPlan.versionAlgorithm
comment: (Modified) OperationDefinition.versionAlgorithm
comment: (Modified) ImplementationGuide.versionAlgorithm
comment: (Modified) CapabilityStatement.versionAlgorithm

_subject
type: ObjectProperty
comment: (Modified) Condition.subject
comment: (Modified) DocumentReference.subject
comment: (Modified) RequestOrchestration.subject
comment: (Modified) GenomicStudy.subject
comment: (Modified) Composition.subject
comment: (Modified) Basic.subject
comment: (Modified) Goal.subject
comment: (Modified) Appointment.subject
comment: (Modified) QuestionnaireResponse.subject
comment: (Modified) Consent.subject
comment: (Modified) MedicationRequest.subject
comment: (Modified) ClinicalUseDefinition.subject
comment: (Modified) DeviceRequest.subject
comment: (Modified) Contract.term.group.action.subject
comment: (Modified) DeviceDispense.subject
comment: (Modified) RiskAssessment.subject
comment: (Modified) ObservationDefinition.subject
comment: (Modified) ActivityDefinition.subject
comment: (Modified) List.subject
comment: (Modified) Flag.subject
comment: (Modified) EvidenceReport.subject
comment: (Modified) MedicationDispense.subject
comment: (Modified) DataRequirement.subject
comment: (Modified) Contract.subject
comment: (Modified) PlanDefinition.subject
comment: (Modified) NutritionIntake.subject
comment: (Modified) ResearchSubject.subject
comment: (Modified) Account.subject
comment: (Modified) GuidanceResponse.subject
comment: (Modified) ChargeItem.subject
comment: (Modified) CommunicationRequest.subject
comment: (Modified) MeasureReport.group.subject
comment: (Modified) SpecimenDefinition.subject
comment: (Modified) MedicationAdministration.subject
comment: (Modified) AdverseEvent.subject
comment: (Modified) CarePlan.subject
comment: (Modified) ServiceRequest.subject
comment: (Modified) MolecularSequence.subject
comment: (Modified) Encounter.subject
comment: (Modified) ImagingStudy.subject
comment: (Modified) DiagnosticReport.subject
comment: (Modified) MedicationStatement.subject
comment: (Modified) Measure.subject
comment: (Modified) Invoice.subject
comment: (Modified) NutritionOrder.subject
comment: (Modified) Measure.group.subject
comment: (Modified) DeviceAssociation.subject
comment: (Modified) CareTeam.subject
comment: (Modified) PlanDefinition.action.subject
comment: (Modified) RegulatedAuthorization.subject
comment: (Modified) Observation.subject
comment: (Modified) Communication.subject
comment: (Modified) EncounterHistory.subject
comment: (Modified) EventDefinition.subject
comment: (Modified) MeasureReport.subject
comment: (Modified) ClinicalImpression.subject
comment: (Modified) Procedure.subject
comment: (Modified) Library.subject
comment: (Modified) PlanDefinition.action.action.subject
comment: (Modified) InventoryItem.instance.subject
comment: (Modified) ImagingSelection.subject
comment: (Modified) Specimen.subject
comment: (Modified) Contract.term.action.subject
comment: (Modified) DetectedIssue.subject

_case
type: ObjectProperty
comment: (Modified) RegulatedAuthorization.case

_ClinicalUseDefinition
type: Class
comment: (Modified) ClinicalUseDefinition
subclass of: DomainResource

_cylinder
type: ObjectProperty
comment: (Modified) VisionPrescription.lensSpecification.cylinder

_saturday
type: ObjectProperty
comment: (Modified) Appointment.recurrenceTemplate.weeklyTemplate.saturday

ConceptMapGroupUnmappedComponent
type: Class
comment: ConceptMapGroupComponent.ConceptMapGroupUnmappedComponent: What to do when there is no mapping to a target concept from the source concept and ConceptMap.group.element.noMap is not true. This provides the "default" to be applied when there is no target concept mapping specified or the expansion of ConceptMap.group.element.target.valueSet is empty.
subclass of: BackboneElement
subclass of: Restriction
  all values from: canonical
  on property: valueSet
subclass of: Restriction
  max cardinality: 1
  on property: valueSet
subclass of: Restriction
  all values from: string
  on property: display
subclass of: Restriction
  all values from: code
  on property: mode
subclass of: Restriction
  all values from: canonical
  on property: otherMap
subclass of: Restriction
  all values from: code
  on property: relationship
subclass of: Restriction
  cardinality: 1
  on property: mode
subclass of: Restriction
  max cardinality: 1
  on property: otherMap
subclass of: Restriction
  max cardinality: 1
  on property: code
subclass of: Restriction
  all values from: code
  on property: code
subclass of: Restriction
  max cardinality: 1
  on property: relationship
subclass of: Restriction
  max cardinality: 1
  on property: display

Address
type: Class
comment: An address expressed using postal conventions (as opposed to GPS or other location definition formats). This data type may be used to convey addresses for use in delivering mail as well as for visiting locations which might not be valid for mail delivery. There are a variety of postal address formats defined around the world. The ISO21090-codedString may be used to provide a coded representation of the contents of strings in an Address.
subclass of: DataType
subclass of: Restriction
  max cardinality: 1
  on property: period
subclass of: Restriction
  all values from: string
  on property: line
subclass of: Restriction
  all values from: code
  on property: type
subclass of: Restriction
  max cardinality: 1
  on property: city
subclass of: Restriction
  all values from: string
  on property: district
subclass of: Restriction
  all values from: string
  on property: city
subclass of: Restriction
  max cardinality: 1
  on property: district
subclass of: Restriction
  max cardinality: 1
  on property: use
subclass of: Restriction
  all values from: string
  on property: postalCode
subclass of: Restriction
  all values from: string
  on property: state
subclass of: Restriction
  all values from: Period
  on property: period
subclass of: Restriction
  max cardinality: 1
  on property: text
subclass of: Restriction
  max cardinality: 1
  on property: state
subclass of: Restriction
  max cardinality: 1
  on property: postalCode
subclass of: Restriction
  all values from: string
  on property: text
subclass of: Restriction
  all values from: code
  on property: use
subclass of: Restriction
  max cardinality: 1
  on property: country
subclass of: Restriction
  max cardinality: 1
  on property: type
subclass of: Restriction
  all values from: string
  on property: country
title: An address expressed using postal conventions (as opposed to GPS or other location definition formats)

_validateCode
type: ObjectProperty
comment: (Modified) TerminologyCapabilities.validateCode

_dispenser
type: ObjectProperty
comment: (Modified) MedicationRequest.dispenseRequest.dispenser

_issued
type: ObjectProperty
comment: (Modified) TestReport.issued
comment: (Modified) Observation.issued
comment: (Modified) ImagingSelection.issued
comment: (Modified) DiagnosticReport.issued
comment: (Modified) Contract.term.group.issued
comment: (Modified) Contract.term.issued
comment: (Modified) Contract.issued

TestReport
type: Class
comment: A summary of information based on the results of executing a TestScript.
subclass of: conformance.misc
subclass of: DomainResource
subclass of: Restriction
  all values from: canonical
  on property: testScript
subclass of: Restriction
  all values from: code
  on property: status
subclass of: Restriction
  all values from: string
  on property: tester
subclass of: Restriction
  all values from: TestReportTeardownComponent
  on property: teardown
subclass of: Restriction
  max cardinality: 1
  on property: tester
subclass of: Restriction
  all values from: dateTime
  on property: issued
subclass of: Restriction
  all values from: string
  on property: name
subclass of: Restriction
  all values from: TestReportParticipantComponent
  on property: participant
subclass of: Restriction
  cardinality: 1
  on property: result
subclass of: Restriction
  all values from: decimal
  on property: score
subclass of: Restriction
  all values from: TestReportSetupComponent
  on property: setup
subclass of: Restriction
  cardinality: 1
  on property: testScript
subclass of: Restriction
  max cardinality: 1
  on property: teardown
subclass of: Restriction
  all values from: code
  on property: result
subclass of: Restriction
  cardinality: 1
  on property: status
subclass of: Restriction
  all values from: TestReportTestComponent
  on property: test
subclass of: Restriction
  max cardinality: 1
  on property: name
subclass of: Restriction
  max cardinality: 1
  on property: identifier
subclass of: Restriction
  max cardinality: 1
  on property: issued
subclass of: Restriction
  max cardinality: 1
  on property: score
subclass of: Restriction
  max cardinality: 1
  on property: setup
subclass of: Restriction
  all values from: Identifier
  on property: identifier
modifierExtensionClass: _TestReport

conditionalRead
type: ObjectProperty
comment: CapabilityStatement.rest.resource.conditionalRead: A code that indicates how the server supports conditional read.
modifierExtensionProperty: _conditionalRead
title: CapabilityStatement.rest.resource.conditionalRead: not-supported | modified-since | not-match | full-support

fullUrl
type: ObjectProperty
comment: Bundle.entry.fullUrl: The Absolute URL for the resource. Except for transactions and batches, each entry in a Bundle must have a fullUrl. The fullUrl SHALL NOT disagree with the id in the resource - i.e. if the fullUrl is not a urn:uuid, the URL shall be version-independent URL consistent with the Resource.id. The fullUrl is a version independent reference to the resource. Even when not required, fullUrl MAY be set to a urn:uuid to allow referencing entries in a transaction. The fullUrl can be an arbitrary URI and is not limited to urn:uuid, urn:oid, http, and https. The fullUrl element SHALL have a value except when: * invoking a create * invoking or responding to an operation where the body is not a single identified resource * invoking or returning the results of a search or history operation.
modifierExtensionProperty: fullUrl
title: Bundle.entry.fullUrl: URI for resource (e.g. the absolute URL server address, URI for UUID/OID, etc.)

parameterFocus
type: ObjectProperty
comment: ServiceRequest.orderDetail.parameterFocus: Indicates the context of the order details by reference.
modifierExtensionProperty: parameterFocus
title: ServiceRequest.orderDetail.parameterFocus: The context of the order details by reference

_currentState
type: ObjectProperty
comment: (Modified) Citation.citedArtifact.currentState
comment: (Modified) Citation.currentState

ActivityDefinition
type: Class
comment: This resource allows for the definition of some activity to be performed, independent of a particular patient, practitioner, or other performance context.
subclass of: MetadataResource
subclass of: clinical.general
subclass of: Restriction
  all values from: string
  on property: version
subclass of:
  union of: Restriction
    all values from: string
    on property: versionAlgorithm
  union of: Restriction
    max cardinality: 1
    on property: versionAlgorithm
  union of: Restriction
    all values from: Coding
    on property: versionAlgorithm
  union of: Restriction
    max cardinality: 1
    on property: versionAlgorithm
subclass of: Restriction
  all values from: canonical
  on property: observationResultRequirement
subclass of: Restriction
  all values from: ContactDetail
  on property: endorser
subclass of: Restriction
  all values from: string
  on property: name
subclass of: Restriction
  max cardinality: 1
  on property: code
subclass of: Restriction
  max cardinality: 1
  on property: purpose
subclass of: Restriction
  max cardinality: 1
  on property: date
subclass of: Restriction
  max cardinality: 1
  on property: approvalDate
subclass of: Restriction
  max cardinality: 1
  on property: location
subclass of: Restriction
  max cardinality: 1
  on property: experimental
subclass of: Restriction
  max cardinality: 1
  on property: title
subclass of: Restriction
  all values from: ContactDetail
  on property: editor
subclass of: Restriction
  all values from: markdown
  on property: description
subclass of: Restriction
  all values from: ActivityDefinitionDynamicValueComponent
  on property: dynamicValue
subclass of: Restriction
  max cardinality: 1
  on property: effectivePeriod
subclass of: Restriction
  max cardinality: 1
  on property: copyrightLabel
subclass of: Restriction
  max cardinality: 1
  on property: description
subclass of: Restriction
  all values from: dateTime
  on property: date
subclass of: Restriction
  all values from: string
  on property: publisher
subclass of: Restriction
  all values from: CodeableConcept
  on property: code
subclass of: Restriction
  all values from: Period
  on property: effectivePeriod
subclass of: Restriction
  max cardinality: 1
  on property: usage
subclass of: Restriction
  all values from: CodeableConcept
  on property: topic
subclass of: Restriction
  max cardinality: 1
  on property: lastReviewDate
subclass of: Restriction
  all values from: CodeableConcept
  on property: jurisdiction
subclass of:
  union of: Restriction
    all values from: CodeableConcept
    on property: subject
  union of: Restriction
    max cardinality: 1
    on property: subject
  union of: Restriction
    all values from: Reference
    on property: subject
  union of: Restriction
    max cardinality: 1
    on property: subject
  union of: Restriction
    all values from: canonical
    on property: subject
  union of: Restriction
    max cardinality: 1
    on property: subject
subclass of: Restriction
  all values from: uri
  on property: url
subclass of: Restriction
  all values from: Dosage
  on property: dosage
subclass of: Restriction
  all values from: ContactDetail
  on property: author
subclass of: Restriction
  all values from: RelatedArtifact
  on property: relatedArtifact
subclass of: Restriction
  all values from: string
  on property: subtitle
subclass of:
  union of: Restriction
    all values from: Reference
    on property: product
  union of: Restriction
    max cardinality: 1
    on property: product
  union of: Restriction
    all values from: CodeableConcept
    on property: product
  union of: Restriction
    max cardinality: 1
    on property: product
subclass of: Restriction
  all values from: markdown
  on property: usage
subclass of: Restriction
  all values from: boolean
  on property: doNotPerform
subclass of: Restriction
  all values from: date
  on property: lastReviewDate
subclass of: Restriction
  all values from: CodeableReference
  on property: location
subclass of: Restriction
  max cardinality: 1
  on property: version
subclass of: Restriction
  all values from: SimpleQuantity
  on property: quantity
subclass of: Restriction
  max cardinality: 1
  on property: priority
subclass of:
  union of: Restriction
    all values from: Timing
    on property: timing
  union of: Restriction
    max cardinality: 1
    on property: timing
  union of: Restriction
    all values from: Age
    on property: timing
  union of: Restriction
    max cardinality: 1
    on property: timing
  union of: Restriction
    all values from: Range
    on property: timing
  union of: Restriction
    max cardinality: 1
    on property: timing
  union of: Restriction
    all values from: Duration
    on property: timing
  union of: Restriction
    max cardinality: 1
    on property: timing
subclass of: Restriction
  all values from: canonical
  on property: transform
subclass of: Restriction
  all values from: code
  on property: priority
subclass of: Restriction
  all values from: canonical
  on property: specimenRequirement
subclass of: Restriction
  all values from: canonical
  on property: observationRequirement
subclass of: Restriction
  max cardinality: 1
  on property: quantity

daysOfWeek
type: ObjectProperty
comment: Availability.availableTime.daysOfWeek: mon | tue | wed | thu | fri | sat | sun.
modifierExtensionProperty: _daysOfWeek
title: Availability.availableTime.daysOfWeek: mon | tue | wed | thu | fri | sat | sun

containedInstance
type: ObjectProperty
comment: ExampleScenario.instance.containedInstance: References to other instances that can be found within this instance (e.g. the observations contained in a bundle).
modifierExtensionProperty: containedInstance
title: ExampleScenario.instance.containedInstance: Resources contained in the instance

StructureMapGroupRuleSourceComponent
type: Class
comment: StructureMapGroupComponent.StructureMapGroupRuleComponentRule.StructureMapGroupRuleSourceComponent: Source inputs to the mapping.
comment: StructureMapGroupComponent.StructureMapGroupRuleComponent.StructureMapGroupRuleSourceComponent: Source inputs to the mapping.
subclass of: BackboneElement
subclass of: Restriction
  all values from: id
  on property: context
subclass of: Restriction
  max cardinality: 1
  on property: type
subclass of: Restriction
  max cardinality: 1
  on property: logMessage
subclass of: Restriction
  all values from: id
  on property: variable
subclass of: Restriction
  all values from: string
  on property: element
subclass of: Restriction
  all values from: string
  on property: condition
subclass of: Restriction
  all values from: string
  on property: max
subclass of: Restriction
  max cardinality: 1
  on property: check
subclass of: Restriction
  all values from: integer
  on property: min
subclass of: Restriction
  max cardinality: 1
  on property: listMode
subclass of: Restriction
  max cardinality: 1
  on property: condition
subclass of: Restriction
  max cardinality: 1
  on property: element
subclass of: Restriction
  max cardinality: 1
  on property: listMode
subclass of: Restriction
  all values from: code
  on property: listMode
subclass of: Restriction
  max cardinality: 1
  on property: max
subclass of: Restriction
  all values from: string
  on property: check
subclass of: Restriction
  all values from: code
  on property: listMode
subclass of: Restriction
  max cardinality: 1
  on property: max
subclass of: Restriction
  max cardinality: 1
  on property: check
subclass of: Restriction
  all values from: string
  on property: condition
subclass of: Restriction
  all values from: integer
  on property: min
subclass of: Restriction
  all values from: string
  on property: logMessage
subclass of: Restriction
  max cardinality: 1
  on property: logMessage
subclass of: Restriction
  all values from: id
  on property: context
subclass of: Restriction
  cardinality: 1
  on property: context
subclass of: Restriction
  max cardinality: 1
  on property: min
subclass of: Restriction
  all values from: id
  on property: variable
subclass of: Restriction
  max cardinality: 1
  on property: type
subclass of: Restriction
  max cardinality: 1
  on property: variable
subclass of: Restriction
  cardinality: 1
  on property: context
subclass of: Restriction
  all values from: string
  on property: logMessage
subclass of: Restriction
  all values from: string
  on property: type
subclass of: Restriction
  all values from: string
  on property: type
subclass of: Restriction
  max cardinality: 1
  on property: variable
subclass of: Restriction
  max cardinality: 1
  on property: condition
subclass of: Restriction
  all values from: string
  on property: check
subclass of: Restriction
  all values from: string
  on property: element
subclass of: Restriction
  max cardinality: 1
  on property: element
subclass of: Restriction
  max cardinality: 1
  on property: defaultValue
subclass of: Restriction
  all values from: string
  on property: defaultValue
subclass of: Restriction
  all values from: string
  on property: defaultValue
subclass of: Restriction
  max cardinality: 1
  on property: min
subclass of: Restriction
  all values from: string
  on property: max
subclass of: Restriction
  max cardinality: 1
  on property: defaultValue

application
type: ObjectProperty
comment: RegulatedAuthorization.case.application: A regulatory submission from an organization to a regulator, as part of an assessing case. Multiple applications may occur over time, with more or different information to support or modify the submission or the authorization. The applications can be considered as steps within the longer running case or procedure for this authorization process.
comment: RegulatedAuthorization.case.application.application: A regulatory submission from an organization to a regulator, as part of an assessing case. Multiple applications may occur over time, with more or different information to support or modify the submission or the authorization. The applications can be considered as steps within the longer running case or procedure for this authorization process.
modifierExtensionProperty: _application
title: RegulatedAuthorization.case.application: Applications submitted to obtain a regulated authorization. Steps within the longer running case or procedure
title: RegulatedAuthorization.case.application.application: Applications submitted to obtain a regulated authorization. Steps within the longer running case or procedure

received
type: ObjectProperty
comment: Communication.received: The time when this communication arrived at the destination.
sub property of: when.done
modifierExtensionProperty: _received
title: Communication.received: When received

AuditEventEntityComponentAgent
type: Class
comment: The entity is attributed to an agent to express the agent's responsibility for that entity in the activity. This is most used to indicate when persistence media (the entity) are used by an agent. For example when importing data from a device, the device would be described in an entity, and the user importing data from that media would be indicated as the entity.agent.
subclass of: BackboneElement
subclass of: Restriction
  cardinality: 1
  on property: who
subclass of:
  union of: Restriction
    all values from: Reference
    on property: network
  union of: Restriction
    max cardinality: 1
    on property: network
  union of: Restriction
    all values from: uri
    on property: network
  union of: Restriction
    max cardinality: 1
    on property: network
  union of: Restriction
    all values from: string
    on property: network
  union of: Restriction
    max cardinality: 1
    on property: network
subclass of: Restriction
  all values from: uri
  on property: policy
subclass of: Restriction
  all values from: boolean
  on property: requestor
subclass of: Restriction
  all values from: CodeableConcept
  on property: authorization
subclass of: Restriction
  max cardinality: 1
  on property: location
subclass of: Restriction
  max cardinality: 1
  on property: requestor
subclass of: Restriction
  max cardinality: 1
  on property: type
subclass of: Restriction
  all values from: CodeableConcept
  on property: role
subclass of: Restriction
  all values from: CodeableConcept
  on property: type
subclass of: Restriction
  all values from: Reference
  on property: who
subclass of: Restriction
  all values from: Reference
  on property: location
title: Entity is attributed to this agent

element
type: ObjectProperty
comment: StructureDefinition.differential.element: Captures constraints on each element within the resource.
comment: StructureMap.group.rule.target.element: Field to create in the context.
comment: StructureMap.group.rule.rule.target.element: Field to create in the context.
comment: StructureDefinition.snapshot.element: Captures constraints on each element within the resource.
comment: ConceptMap.group.element: Mappings for an individual concept in the source to one or more concepts in the target.
comment: StructureMap.group.rule.source.element: Optional field for this source.
comment: StructureMap.group.rule.rule.source.element: Optional field for this source.
comment: SubstanceReferenceInformation.geneElement.element: Todo.
modifierExtensionProperty: element
title: StructureDefinition.snapshot.element: Definition of elements in the resource (if no StructureDefinition)
title: SubstanceReferenceInformation.geneElement.element: Todo
title: ConceptMap.group.element: Mappings for a concept from the source set
title: StructureMap.group.rule.rule.target.element: Field to create in the context
title: StructureDefinition.differential.element: Definition of elements in the resource (if no StructureDefinition)
title: StructureMap.group.rule.rule.source.element: Optional field for this source
title: StructureMap.group.rule.target.element: Field to create in the context
title: StructureMap.group.rule.source.element: Optional field for this source

_compose
type: ObjectProperty
comment: (Modified) ValueSet.compose

_environmentalSetting
type: ObjectProperty
comment: (Modified) MedicationKnowledge.storageGuideline.environmentalSetting

_payment
type: ObjectProperty
comment: (Modified) PaymentNotice.payment
comment: (Modified) ExplanationOfBenefit.payment
comment: (Modified) Contract.term.group.asset.valuedItem.payment
comment: (Modified) Contract.term.asset.valuedItem.payment
comment: (Modified) ClaimResponse.payment

_preparedDate
type: ObjectProperty
comment: (Modified) DeviceDispense.preparedDate
comment: (Modified) BiologicallyDerivedProductDispense.preparedDate

ImagingSelectionInstanceComponent
type: Class
comment: ImagingSelectionInstanceComponent: Each imaging selection includes one or more selected DICOM SOP instances.
subclass of: BackboneElement
subclass of: Restriction
  max cardinality: 1
  on property: sopClass
subclass of: Restriction
  all values from: id
  on property: uid
subclass of: Restriction
  all values from: unsignedInt
  on property: number
subclass of: Restriction
  cardinality: 1
  on property: uid
subclass of: Restriction
  all values from: ImageRegion2D
  on property: imageRegion2D
subclass of: Restriction
  all values from: string
  on property: subset
subclass of: Restriction
  all values from: ImageRegion3D
  on property: imageRegion3D
subclass of: Restriction
  all values from: Coding
  on property: sopClass
subclass of: Restriction
  max cardinality: 1
  on property: number

_responseRequired
type: ObjectProperty
comment: (Modified) MessageDefinition.responseRequired

_contraindication
type: ObjectProperty
comment: (Modified) DeviceDefinition.guideline.contraindication
comment: (Modified) ClinicalUseDefinition.contraindication

_operator
type: ObjectProperty
comment: (Modified) TestScript.test.action.assert.operator
comment: (Modified) TestScript.setup.action.assert.operator
comment: (Modified) Questionnaire.item.item.enableWhen.operator
comment: (Modified) Questionnaire.item.enableWhen.operator
comment: (Modified) DeviceAssociation.operation.operator
comment: (Modified) CodeSystem.filter.operator

ActivityDefinitionParticipantComponent
type: Class
comment: ActivityDefinitionParticipantComponent: Indicates who should participate in performing the action described.
subclass of: BackboneElement
subclass of: Restriction
  all values from: CodeableConcept
  on property: function
subclass of: Restriction
  all values from: Reference
  on property: typeReference
subclass of: Restriction
  all values from: canonical
  on property: typeCanonical
subclass of: Restriction
  all values from: CodeableConcept
  on property: role
subclass of: Restriction
  max cardinality: 1
  on property: type
subclass of: Restriction
  all values from: code
  on property: type
subclass of: Restriction
  max cardinality: 1
  on property: role
subclass of: Restriction
  max cardinality: 1
  on property: typeCanonical
subclass of: Restriction
  max cardinality: 1
  on property: function
subclass of: Restriction
  max cardinality: 1
  on property: typeReference

_contraindicatedVaccineCode
type: ObjectProperty
comment: (Modified) ImmunizationRecommendation.recommendation.contraindicatedVaccineCode

_membership
type: ObjectProperty
comment: (Modified) Group.membership

_recordedDate
type: ObjectProperty
comment: (Modified) Condition.recordedDate
comment: (Modified) AllergyIntolerance.recordedDate
comment: (Modified) AdverseEvent.recordedDate

_provision
type: ObjectProperty
comment: (Modified) Consent.provision.provision
comment: (Modified) Consent.provision.provision.provision
comment: (Modified) Consent.provision

_dietPreference
type: ObjectProperty
comment: (Modified) Encounter.dietPreference

_laterality
type: ObjectProperty
comment: (Modified) ImagingStudy.series.laterality
comment: (Modified) BodyStructure.excludedStructure.laterality
comment: (Modified) BodyStructure.includedStructure.laterality

_parentSubstanceId
type: ObjectProperty
comment: (Modified) SubstanceSourceMaterial.parentSubstanceId

_report
type: ObjectProperty
comment: (Modified) Procedure.report

MedicationDispensePerformerComponent
type: Class
comment: MedicationDispensePerformerComponent: Indicates who or what performed the event.
subclass of: BackboneElement
subclass of: Restriction
  cardinality: 1
  on property: actor
subclass of: Restriction
  all values from: Reference
  on property: actor
subclass of: Restriction
  max cardinality: 1
  on property: function
subclass of: Restriction
  all values from: CodeableConcept
  on property: function

FamilyMemberHistoryConditionComponent
type: Class
comment: FamilyMemberHistoryConditionComponent: The significant Conditions (or condition) that the family member had. This is a repeating section to allow a system to represent more than one condition per resource, though there is nothing stopping multiple resources - one per condition.
subclass of: BackboneElement
subclass of:
  union of: Restriction
    all values from: Age
    on property: onset
  union of: Restriction
    max cardinality: 1
    on property: onset
  union of: Restriction
    all values from: Range
    on property: onset
  union of: Restriction
    max cardinality: 1
    on property: onset
  union of: Restriction
    all values from: Period
    on property: onset
  union of: Restriction
    max cardinality: 1
    on property: onset
  union of: Restriction
    all values from: string
    on property: onset
  union of: Restriction
    max cardinality: 1
    on property: onset
subclass of: Restriction
  all values from: CodeableConcept
  on property: outcome
subclass of: Restriction
  all values from: Annotation
  on property: note
subclass of: Restriction
  cardinality: 1
  on property: code
subclass of: Restriction
  max cardinality: 1
  on property: contributedToDeath
subclass of: Restriction
  all values from: CodeableConcept
  on property: code
subclass of: Restriction
  all values from: boolean
  on property: contributedToDeath
subclass of: Restriction
  max cardinality: 1
  on property: outcome

_editor
type: ObjectProperty
comment: (Modified) EvidenceVariable.editor
comment: (Modified) Evidence.editor
comment: (Modified) ConceptMap.editor
comment: (Modified) ActivityDefinition.editor
comment: (Modified) Measure.editor
comment: (Modified) NamingSystem.editor
comment: (Modified) EventDefinition.editor
comment: (Modified) PlanDefinition.editor
comment: (Modified) ValueSet.editor
comment: (Modified) CodeSystem.editor
comment: (Modified) EvidenceReport.editor
comment: (Modified) Citation.editor
comment: (Modified) Library.editor
comment: (Modified) MetadataResource.editor

instant
type: Class
comment: An instant in time - known at least to the second
subclass of: Primitive
subclass of: Restriction
  cardinality: 1
  on property: http://hl7.org/fhir/v
subclass of: Restriction
  all values from: dateTime
  on property: http://hl7.org/fhir/v

paging
type: ObjectProperty
comment: TerminologyCapabilities.expansion.paging: Whether the server supports paging on expansion.
modifierExtensionProperty: _paging
title: TerminologyCapabilities.expansion.paging: Whether the server supports paging on expansion

ExampleScenarioProcessComponent.ExampleScenarioProcessStepComponentProcess.ExampleScenarioProcessStepComponentProcess
type: Class
comment: Indicates that the step is a complex sub-process with its own steps.
subclass of: BackboneElement
title: Step is nested process

_receiverActive
type: ObjectProperty
comment: (Modified) ExampleScenario.process.step.alternative.step.operation.receiverActive
comment: (Modified) ExampleScenario.process.step.alternative.step.process.step.operation.receiverActive
comment: (Modified) ExampleScenario.process.step.operation.receiverActive
comment: (Modified) ExampleScenario.process.step.process.step.alternative.step.operation.receiverActive
comment: (Modified) ExampleScenario.process.step.process.step.operation.receiverActive

publicationForm
type: ObjectProperty
comment: Citation.citedArtifact.publicationForm: If multiple, used to represent alternative forms of the article that are not separate citations.
modifierExtensionProperty: _publicationForm
title: Citation.citedArtifact.publicationForm: If multiple, used to represent alternative forms of the article that are not separate citations

operation
type: ObjectProperty
comment: TestScript.teardown.action.operation: An operation would involve a REST request to a server.
comment: DeviceAssociation.operation: The details about the device when it is in use to describe its operation.
comment: TestScript.setup.action.operation: The operation to perform.
comment: ExampleScenario.process.step.process.step.alternative.step.operation: The step represents a single operation invoked on receiver by sender.
comment: ExampleScenario.process.step.process.step.operation: The step represents a single operation invoked on receiver by sender.
comment: CapabilityStatement.rest.resource.operation: Definition of an operation or a named query together with its parameters and their meaning and type. Consult the definition of the operation for details about how to invoke the operation, and the parameters.
comment: ExampleScenario.process.step.alternative.step.process.step.operation: The step represents a single operation invoked on receiver by sender.
comment: TestReport.setup.action.operation: The operation performed.
comment: CapabilityStatement.rest.operation: Definition of an operation or a named query together with its parameters and their meaning and type.
comment: MedicinalProductDefinition.operation: A manufacturing or administrative process or step associated with (or performed on) the medicinal product.
comment: TestReport.test.action.operation: An operation would involve a REST request to a server.
comment: TestReport.teardown.action.operation: An operation would involve a REST request to a server.
comment: ExampleScenario.process.step.operation: The step represents a single operation invoked on receiver by sender.
comment: ExampleScenario.process.step.alternative.step.operation: The step represents a single operation invoked on receiver by sender.
comment: TestScript.test.action.operation: An operation would involve a REST request to a server.
modifierExtensionProperty: operation
title: MedicinalProductDefinition.operation: A manufacturing or administrative process for the medicinal product
title: TestReport.setup.action.operation: The operation to perform
title: TestScript.teardown.action.operation: The teardown operation to perform
title: TestReport.teardown.action.operation: The teardown operation performed
title: TestReport.test.action.operation: The operation performed
title: TestScript.test.action.operation: The setup operation to perform
title: CapabilityStatement.rest.operation: Definition of a system level operation
title: DeviceAssociation.operation: The details about the device when it is in use to describe its operation
title: ExampleScenario.process.step.process.step.alternative.step.operation: Step is simple action
title: ExampleScenario.process.step.alternative.step.operation: Step is simple action
title: ExampleScenario.process.step.operation: Step is simple action
title: ExampleScenario.process.step.alternative.step.process.step.operation: Step is simple action
title: ExampleScenario.process.step.process.step.operation: Step is simple action
title: CapabilityStatement.rest.resource.operation: Definition of a resource operation
title: TestScript.setup.action.operation: The setup operation to perform

organism
type: ObjectProperty
comment: SubstanceSourceMaterial.organism: This subclause describes the organism which the substance is derived from. For vaccines, the parent organism shall be specified based on these subclause elements. As an example, full taxonomy will be described for the Substance Name: ., Leaf.
comment: SubstanceReferenceInformation.target.organism: Todo.
modifierExtensionProperty: _organism
title: SubstanceSourceMaterial.organism: This subclause describes the organism which the substance is derived from. For vaccines, the parent organism shall be specified based on these subclause elements. As an example, full taxonomy will be described for the Substance Name: ., Leaf
title: SubstanceReferenceInformation.target.organism: Todo

focus
type: ObjectProperty
comment: Composition.section.focus: The actual focus of the section when it is not the subject of the composition, but instead represents something or someone associated with the subject such as (for a patient subject) a spouse, parent, fetus, or donor. If not focus is specified, the focus is assumed to be focus of the parent section, or, for a section in the Composition itself, the subject of the composition. Sections with a focus SHALL only include resources where the logical subject (patient, subject, focus, etc.) matches the section focus, or the resources have no logical subject (few resources).
comment: MolecularSequence.focus: The actual focus of a molecular sequence when it is not the patient of record representing something or someone associated with the patient such as a spouse, parent, child, or sibling. For example, in trio testing, the subject would be the child (proband) and the focus would be the parent.
comment: Transport.focus: The request being actioned or the resource being manipulated by this transport.
comment: ImagingSelection.focus: The actual focus of an observation when it is not the patient of record representing something or someone associated with the patient such as a spouse, parent, fetus, or donor. For example, fetus observations in a mother's record. The focus of an observation could also be an existing condition, an intervention, the subject's diet, another observation of the subject, or a body structure such as tumor or implanted device. An example use case would be using the Observation resource to capture whether the mother is trained to change her child's tracheostomy tube. In this example, the child is the patient of record and the mother is the focus.
comment: Task.focus: The request being fulfilled or the resource being manipulated (changed, suspended, etc.) by this task.
comment: SubscriptionStatus.notificationEvent.focus: The focus of this event. While this will usually be a reference to the focus resource of the event, it MAY contain a reference to a non-FHIR object.
comment: EvidenceReport.section.focus: A code identifying the kind of content contained within the section. This should be consistent with the section title.
comment: ServiceRequest.focus: The actual focus of a service request when it is not the subject of record representing something or someone associated with the subject such as a spouse, parent, fetus, or donor. The focus of a service request could also be an existing condition, an intervention, the subject's diet, another service request on the subject, or a body structure such as tumor or implanted device.
comment: GenomicStudy.analysis.focus: The focus of a genomic analysis when it is not the patient of record representing something or someone associated with the patient such as a spouse, parent, child, or sibling. For example, in trio testing, the GenomicStudy.subject would be the child (proband) and the GenomicStudy.analysis.focus of a specific analysis would be the parent.
comment: ResearchStudy.focus: The medication(s), food(s), therapy(ies), device(s) or other concerns or interventions that the study is seeking to gain more information about.
comment: MessageHeader.focus: The actual data of the message - a reference to the root/focus class of the event. This is allowed to be a Parameters resource.
comment: EvidenceReport.section.section.focus: A code identifying the kind of content contained within the section. This should be consistent with the section title.
comment: Composition.section.section.focus: The actual focus of the section when it is not the subject of the composition, but instead represents something or someone associated with the subject such as (for a patient subject) a spouse, parent, fetus, or donor. If not focus is specified, the focus is assumed to be focus of the parent section, or, for a section in the Composition itself, the subject of the composition. Sections with a focus SHALL only include resources where the logical subject (patient, subject, focus, etc.) matches the section focus, or the resources have no logical subject (few resources).
comment: Procedure.focus: Who is the target of the procedure when it is not the subject of record only. If focus is not present, then subject is the focus. If focus is present and the subject is one of the targets of the procedure, include subject as a focus as well. If focus is present and the subject is not included in focus, it implies that the procedure was only targeted on the focus. For example, when a caregiver is given education for a patient, the caregiver would be the focus and the procedure record is associated with the subject (e.g. patient). For example, use focus when recording the target of the education, training, or counseling is the parent or relative of a patient.
comment: Observation.focus: The actual focus of an observation when it is not the patient of record representing something or someone associated with the patient such as a spouse, parent, fetus, or donor. For example, fetus observations in a mother's record. The focus of an observation could also be an existing condition, an intervention, the subject's diet, another observation of the subject, or a body structure such as tumor or implanted device. An example use case would be using the Observation resource to capture whether the mother is trained to change her child's tracheostomy tube. In this example, the child is the patient of record and the mother is the focus.
comment: MessageDefinition.focus: Identifies the resource (or resources) that are being addressed by the event. For example, the Encounter for an admit message or two Account records for a merge.
sub property of: what
sub property of: who.focus
modifierExtensionProperty: focus
title: Observation.focus: What the observation is about, when it is not about the subject of record
title: EvidenceReport.section.section.focus: Classification of section (recommended)
title: SubscriptionStatus.notificationEvent.focus: Reference to the primary resource or information of this event
title: Transport.focus: What transport is acting on
title: MolecularSequence.focus: What the molecular sequence is about, when it is not about the subject of record
title: Procedure.focus: Who is the target of the procedure when it is not the subject of record only
title: MessageDefinition.focus: Resource(s) that are the subject of the event
title: ResearchStudy.focus: Drugs, devices, etc. under study
title: ServiceRequest.focus: What the service request is about, when it is not about the subject of record
title: MessageHeader.focus: The actual content of the message
title: Composition.section.focus: Who/what the section is about, when it is not about the subject of composition
title: Task.focus: What task is acting on
title: GenomicStudy.analysis.focus: What the genomic analysis is about, when it is not about the subject of record
title: ImagingSelection.focus: Related resource that is the focus for the imaging selection
title: EvidenceReport.section.focus: Classification of section (recommended)
title: Composition.section.section.focus: Who/what the section is about, when it is not about the subject of composition

_reviewer
type: ObjectProperty
comment: (Modified) EvidenceVariable.reviewer
comment: (Modified) PlanDefinition.reviewer
comment: (Modified) MetadataResource.reviewer
comment: (Modified) NamingSystem.reviewer
comment: (Modified) ConceptMap.reviewer
comment: (Modified) CodeSystem.reviewer
comment: (Modified) Citation.reviewer
comment: (Modified) Measure.reviewer
comment: (Modified) EventDefinition.reviewer
comment: (Modified) Evidence.reviewer
comment: (Modified) EvidenceReport.reviewer
comment: (Modified) ActivityDefinition.reviewer
comment: (Modified) ValueSet.reviewer
comment: (Modified) Library.reviewer

validCodedValueSet
type: ObjectProperty
comment: ObservationDefinition.component.qualifiedValue.validCodedValueSet: The set of valid coded results for qualitative observations that match the criteria of this set of qualified values.
comment: ObservationDefinition.qualifiedValue.validCodedValueSet: The set of valid coded results for qualitative observations that match the criteria of this set of qualified values.
modifierExtensionProperty: validCodedValueSet
title: ObservationDefinition.component.qualifiedValue.validCodedValueSet: Value set of valid coded values as part of this set of qualified values
title: ObservationDefinition.qualifiedValue.validCodedValueSet: Value set of valid coded values as part of this set of qualified values

Signatory
type: Class
comment: Contract.Signatory: Parties with legal standing in the Contract, including the principal parties, the grantor(s) and grantee(s), which are any person or organization bound by the contract, and any ancillary parties, which facilitate the execution of the contract such as a notary or witness.
subclass of: BackboneElement
subclass of: Restriction
  all values from: Signature
  on property: signature
subclass of: Restriction
  min cardinality: 1
  on property: signature
subclass of: Restriction
  all values from: Reference
  on property: party
subclass of: Restriction
  cardinality: 1
  on property: party
subclass of: Restriction
  all values from: Coding
  on property: type
subclass of: Restriction
  cardinality: 1
  on property: type

clockFacePosition
type: ObjectProperty
comment: BodyStructure.excludedStructure.bodyLandmarkOrientation.clockFacePosition: An description of the direction away from a landmark something is located based on a radial clock dial.
comment: BodyStructure.includedStructure.bodyLandmarkOrientation.clockFacePosition: An description of the direction away from a landmark something is located based on a radial clock dial.
sub property of: what
modifierExtensionProperty: clockFacePosition
title: BodyStructure.excludedStructure.bodyLandmarkOrientation.clockFacePosition: Clockface orientation
title: BodyStructure.includedStructure.bodyLandmarkOrientation.clockFacePosition: Clockface orientation

_instanceReference
type: ObjectProperty
comment: (Modified) ExampleScenario.process.step.operation.request.instanceReference
comment: (Modified) ExampleScenario.process.step.operation.response.instanceReference
comment: (Modified) ExampleScenario.process.step.process.step.operation.request.instanceReference
comment: (Modified) ExampleScenario.instance.containedInstance.instanceReference
comment: (Modified) ExampleScenario.process.step.process.step.alternative.step.operation.request.instanceReference
comment: (Modified) ExampleScenario.process.step.alternative.step.process.step.operation.request.instanceReference
comment: (Modified) ExampleScenario.process.step.alternative.step.operation.response.instanceReference
comment: (Modified) ExampleScenario.process.step.process.step.alternative.step.operation.response.instanceReference
comment: (Modified) ExampleScenario.process.step.process.step.operation.response.instanceReference
comment: (Modified) ExampleScenario.process.step.alternative.step.operation.request.instanceReference
comment: (Modified) ExampleScenario.process.step.alternative.step.process.step.operation.response.instanceReference

withdrawalPeriod
type: ObjectProperty
comment: AdministrableProductDefinition.routeOfAdministration.targetSpecies.withdrawalPeriod: A species specific time during which consumption of animal product is not appropriate.
modifierExtensionProperty: _withdrawalPeriod
title: AdministrableProductDefinition.routeOfAdministration.targetSpecies.withdrawalPeriod: A species specific time during which consumption of animal product is not appropriate

conformance
type: ObjectProperty
comment: TestScript.scope.conformance: The expectation of whether the test must pass for the system to be considered conformant with the artifact: required - all tests are expected to pass, optional - all test are expected to pass but non-pass status may be allowed, strict - all tests are expected to pass and warnings are treated as a failure.
comment: Requirements.statement.conformance: A short human usable label for this statement.
modifierExtensionProperty: conformance
title: TestScript.scope.conformance: required | optional | strict
title: Requirements.statement.conformance: SHALL | SHOULD | MAY | SHOULD-NOT

effectivePeriod
type: ObjectProperty
comment: EvidenceVariable.effectivePeriod: The period during which the resource content was or is planned to be in active use.
comment: Measure.effectivePeriod: The period during which the measure content was or is planned to be in active use.
comment: ObservationDefinition.effectivePeriod: The period during which the ObservationDefinition content was or is planned to be effective.
comment: Citation.effectivePeriod: The period during which the citation record content was or is planned to be in active use.
comment: SpecimenDefinition.effectivePeriod: The period during which the SpecimenDefinition content was or is planned to be effective.
comment: ConceptMap.effectivePeriod: The period during which the ConceptMap content was or is planned to be in active use.
comment: MetadataResource.effectivePeriod: The period during which the {{title}} content was or is planned to be in active use.
comment: CodeSystem.effectivePeriod: The period during which the CodeSystem content was or is planned to be in active use.
comment: DeviceDefinition.chargeItem.effectivePeriod: A specific time period in which this charge item applies.
comment: EventDefinition.effectivePeriod: The period during which the event definition content was or is planned to be in active use.
comment: ChargeItemDefinition.applicability.effectivePeriod: The period during which the charge item definition content was or is planned to be in active use.
comment: ChargeItemDefinition.propertyGroup.applicability.effectivePeriod: The period during which the charge item definition content was or is planned to be in active use.
comment: NamingSystem.effectivePeriod: The period during which the NamingSystem content was or is planned to be in active use.
comment: SubscriptionTopic.effectivePeriod: The period during which the SubscriptionTopic content was or is planned to be effective.
comment: ActivityDefinition.effectivePeriod: The period during which the activity definition content was or is planned to be in active use.
comment: PlanDefinition.effectivePeriod: The period during which the plan definition content was or is planned to be in active use.
comment: ValueSet.effectivePeriod: The period during which the ValueSet content was or is planned to be in active use.
comment: Library.effectivePeriod: The period during which the library content was or is planned to be in active use.
comment: Questionnaire.effectivePeriod: The period during which the questionnaire content was or is planned to be in active use.
modifierExtensionProperty: _effectivePeriod
title: PlanDefinition.effectivePeriod: When the plan definition is expected to be used
title: SpecimenDefinition.effectivePeriod: The effective date range for the SpecimenDefinition
title: EventDefinition.effectivePeriod: When the event definition is expected to be used
title: EvidenceVariable.effectivePeriod: When the resource is expected to be used
title: ActivityDefinition.effectivePeriod: When the activity definition is expected to be used
title: ChargeItemDefinition.applicability.effectivePeriod: When the charge item definition is expected to be used
title: Citation.effectivePeriod: When the citation record is expected to be used
title: NamingSystem.effectivePeriod: When the NamingSystem is expected to be used
title: MetadataResource.effectivePeriod: When the {{title}} is expected to be used
title: SubscriptionTopic.effectivePeriod: The effective date range for the SubscriptionTopic
title: ObservationDefinition.effectivePeriod: The effective date range for the ObservationDefinition
title: Library.effectivePeriod: When the library is expected to be used
title: ConceptMap.effectivePeriod: When the ConceptMap is expected to be used
title: Questionnaire.effectivePeriod: When the questionnaire is expected to be used
title: ChargeItemDefinition.propertyGroup.applicability.effectivePeriod: When the charge item definition is expected to be used
title: ValueSet.effectivePeriod: When the ValueSet is expected to be used
title: Measure.effectivePeriod: When the measure is expected to be used
title: DeviceDefinition.chargeItem.effectivePeriod: A specific time period in which this charge item applies
title: CodeSystem.effectivePeriod: When the CodeSystem is expected to be used

_matchStatus
type: ObjectProperty
comment: (Modified) BiologicallyDerivedProductDispense.matchStatus

virtualService
type: ObjectProperty
comment: Location.virtualService: Connection details of a virtual service (e.g. shared conference call facility with dedicated number/details).
comment: Encounter.virtualService: Connection details of a virtual service (e.g. conference call).
comment: Appointment.virtualService: Connection details of a virtual service (e.g. conference call).
modifierExtensionProperty: virtualService
title: Location.virtualService: Connection details of a virtual service (e.g. conference call)
title: Encounter.virtualService: Connection details of a virtual service (e.g. conference call)
title: Appointment.virtualService: Connection details of a virtual service (e.g. conference call)

Communication
type: Class
comment: A clinical or business level record of information being transmitted or shared; e.g. an alert that was sent to a responsible provider, a public health agency communication to a provider/reporter in response to a case report for a reportable condition.
subclass of: workflow.encounter
subclass of: DomainResource
subclass of: Restriction
  max cardinality: 1
  on property: sender
subclass of: Restriction
  all values from: Reference
  on property: inResponseTo
subclass of: Restriction
  max cardinality: 1
  on property: encounter
subclass of: Restriction
  all values from: Identifier
  on property: identifier
subclass of: Restriction
  all values from: CodeableReference
  on property: reason
subclass of: Restriction
  all values from: CodeableConcept
  on property: statusReason
subclass of: Restriction
  all values from: Reference
  on property: basedOn
subclass of: Restriction
  all values from: Annotation
  on property: note
subclass of: Restriction
  all values from: CommunicationPayloadComponent
  on property: payload
subclass of: Restriction
  max cardinality: 1
  on property: statusReason
subclass of: Restriction
  all values from: Reference
  on property: recipient
subclass of: Restriction
  all values from: Reference
  on property: subject
subclass of: Restriction
  max cardinality: 1
  on property: subject
subclass of: Restriction
  all values from: uri
  on property: instantiatesUri
subclass of: Restriction
  max cardinality: 1
  on property: received
subclass of: Restriction
  max cardinality: 1
  on property: sent
subclass of: Restriction
  all values from: dateTime
  on property: sent
subclass of: Restriction
  all values from: Reference
  on property: encounter
subclass of: Restriction
  all values from: canonical
  on property: instantiatesCanonical
subclass of: Restriction
  max cardinality: 1
  on property: topic
subclass of: Restriction
  all values from: Reference
  on property: partOf
subclass of: Restriction
  all values from: Reference
  on property: about
subclass of: Restriction
  all values from: Reference
  on property: sender
subclass of: Restriction
  all values from: CodeableConcept
  on property: medium
subclass of: Restriction
  max cardinality: 1
  on property: priority
subclass of: Restriction
  all values from: code
  on property: status
subclass of: Restriction
  all values from: dateTime
  on property: received
subclass of: Restriction
  all values from: CodeableConcept
  on property: topic
subclass of: Restriction
  all values from: code
  on property: priority
subclass of: Restriction
  all values from: CodeableConcept
  on property: category
subclass of: Restriction
  cardinality: 1
  on property: status
modifierExtensionClass: Communication

_enteralFormula
type: ObjectProperty
comment: (Modified) NutritionOrder.enteralFormula

whenHandedOver
type: ObjectProperty
comment: MedicationDispense.whenHandedOver: The time the dispensed product was provided to the patient or their representative.
comment: DeviceDispense.whenHandedOver: The time the dispensed product was made available to the patient or their representative.
comment: BiologicallyDerivedProductDispense.whenHandedOver: When the product was dispatched for clinical use.
modifierExtensionProperty: whenHandedOver
title: MedicationDispense.whenHandedOver: When product was given out
title: DeviceDispense.whenHandedOver: When product was given out
title: BiologicallyDerivedProductDispense.whenHandedOver: When the product was dispatched

EvidenceReportSubjectComponent
type: Class
comment: EvidenceReportSubjectComponent: Specifies the subject or focus of the report. Answers "What is this report about?".
subclass of: BackboneElement
subclass of: Restriction
  all values from: Annotation
  on property: note
subclass of: Restriction
  all values from: EvidenceReportSubjectCharacteristicComponent
  on property: characteristic

substance
type: ObjectProperty
comment: Ingredient.substance: The substance that comprises this ingredient.
comment: Substance.ingredient.substance
comment: DeviceDefinition.material.substance: A substance that the device contains, may contain, or is made of - for example latex - to be used to determine patient compatibility. This is not intended to represent the composition of the device, only the clinically relevant materials.
comment: Ingredient.substance.strength.referenceStrength.substance: Relevant reference substance.
comment: AllergyIntolerance.reaction.substance: Identification of the specific substance (or pharmaceutical product) considered to be responsible for the Adverse Reaction event. Note: the substance for a specific reaction may be different from the substance identified as the cause of the risk, but it must be consistent with it. For instance, it may be a more specific substance (e.g. a brand medication) or a composite product that includes the identified substance. It must be clinically safe to only process the 'code' and ignore the 'reaction.substance'. If a receiving system is unable to confirm that AllergyIntolerance.reaction.substance falls within the semantic scope of AllergyIntolerance.code, then the receiving system should ignore AllergyIntolerance.reaction.substance.
modifierExtensionProperty: substance
title: Ingredient.substance.strength.referenceStrength.substance: Relevant reference substance
title: DeviceDefinition.material.substance: A relevant substance that the device contains, may contain, or is made of
title: AllergyIntolerance.reaction.substance: Specific substance or pharmaceutical product considered to be responsible for event
title: Ingredient.substance: The substance that comprises this ingredient

Section
type: Class
comment: EvidenceReport.Section: The root of the sections that make up the composition.
comment: Composition.Section: The root of the sections that make up the composition.
subclass of: BackboneElement
subclass of: Restriction
  all values from: Reference
  on property: entry
subclass of: Restriction
  all values from: Composition.SectionSection
  on property: section
subclass of: Restriction
  all values from: CodeableConcept
  on property: emptyReason
subclass of: Restriction
  max cardinality: 1
  on property: focus
subclass of: Restriction
  max cardinality: 1
  on property: orderedBy
subclass of: Restriction
  all values from: Narrative
  on property: text
subclass of: Restriction
  all values from: Reference
  on property: author
subclass of: Restriction
  all values from: CodeableConcept
  on property: focus
subclass of: Restriction
  max cardinality: 1
  on property: text
subclass of: Restriction
  all values from: Reference
  on property: entryReference
subclass of: Restriction
  max cardinality: 1
  on property: title
subclass of: Restriction
  all values from: Quantity
  on property: entryQuantity
subclass of: Restriction
  all values from: CodeableConcept
  on property: code
subclass of: Restriction
  all values from: code
  on property: mode
subclass of: Restriction
  max cardinality: 1
  on property: code
subclass of: Restriction
  max cardinality: 1
  on property: title
subclass of: Restriction
  all values from: CodeableConcept
  on property: orderedBy
subclass of: Restriction
  all values from: CodeableConcept
  on property: emptyReason
subclass of: Restriction
  max cardinality: 1
  on property: text
subclass of: Restriction
  all values from: Reference
  on property: author
subclass of: Restriction
  all values from: Narrative
  on property: text
subclass of: Restriction
  all values from: EvidenceReport.SectionSection
  on property: section
subclass of: Restriction
  all values from: CodeableConcept
  on property: orderedBy
subclass of: Restriction
  all values from: Reference
  on property: focus
subclass of: Restriction
  max cardinality: 1
  on property: focus
subclass of: Restriction
  max cardinality: 1
  on property: emptyReason
subclass of: Restriction
  all values from: CodeableConcept
  on property: entryClassifier
subclass of: Restriction
  max cardinality: 1
  on property: mode
subclass of: Restriction
  all values from: Reference
  on property: focusReference
subclass of: Restriction
  max cardinality: 1
  on property: focusReference
subclass of: Restriction
  all values from: string
  on property: title
subclass of: Restriction
  all values from: string
  on property: title
subclass of: Restriction
  max cardinality: 1
  on property: orderedBy
subclass of: Restriction
  max cardinality: 1
  on property: emptyReason

_valueRange
type: ObjectProperty
comment: (Modified) Evidence.statistic.modelCharacteristic.variable.valueRange

regulatoryIdentifier
type: ObjectProperty
comment: DeviceDefinition.regulatoryIdentifier: Identifier associated with the regulatory documentation (certificates, technical documentation, post-market surveillance documentation and reports) of a set of device models sharing the same intended purpose, risk class and essential design and manufacturing characteristics. One example is the Basic UDI-DI in Europe.
modifierExtensionProperty: _regulatoryIdentifier
title: DeviceDefinition.regulatoryIdentifier: Regulatory identifier(s) associated with this device

kind
type: ObjectProperty
comment: NamingSystem.kind: Indicates the purpose for the naming system - what kinds of things does it make unique?
comment: OperationDefinition.kind: Whether this is an operation or a named query.
comment: PlanDefinition.action.action.condition.kind: The kind of condition.
comment: RequestOrchestration.action.condition.kind: The kind of condition.
comment: TerminologyCapabilities.kind: The way that this statement is intended to be used, to describe an actual running instance of software, a particular product (kind, not instance of software) or a class of implementation (e.g. a desired purchase).
comment: CapabilityStatement.kind: The way that this statement is intended to be used, to describe an actual running instance of software, a particular product (kind, not instance of software) or a class of implementation (e.g. a desired purchase).
comment: StructureDefinition.kind: Defines the kind of structure that this definition is describing.
comment: ActivityDefinition.kind: A description of the kind of resource the activity definition is representing. For example, a MedicationRequest, a ServiceRequest, or a CommunicationRequest.
comment: Coverage.kind: The nature of the coverage be it insurance, or cash payment such as self-pay.
comment: PlanDefinition.action.condition.kind: The kind of condition.
comment: RequestOrchestration.action.action.condition.kind: The kind of condition.
comment: PaymentReconciliation.kind: The workflow or activity which gave rise to or during which the payment ocurred such as a kiosk, deposit on account, periodic payment etc.
sub property of: class
modifierExtensionProperty: kind
title: PlanDefinition.action.condition.kind: applicability | start | stop
title: PlanDefinition.action.action.condition.kind: applicability | start | stop
title: Coverage.kind: insurance | self-pay | other
title: TerminologyCapabilities.kind: instance | capability | requirements
title: CapabilityStatement.kind: instance | capability | requirements
title: PaymentReconciliation.kind: Workflow originating payment
title: OperationDefinition.kind: operation | query
title: NamingSystem.kind: codesystem | identifier | root
title: RequestOrchestration.action.condition.kind: applicability | start | stop
title: ActivityDefinition.kind: Kind of resource
title: StructureDefinition.kind: primitive-type | complex-type | resource | logical
title: RequestOrchestration.action.action.condition.kind: applicability | start | stop

hasIngredient
type: ObjectProperty
comment: ManufacturedItemDefinition.component.component.constituent.hasIngredient: The ingredient that is the constituent of the given component.
comment: ManufacturedItemDefinition.component.constituent.hasIngredient: The ingredient that is the constituent of the given component.
modifierExtensionProperty: hasIngredient
title: ManufacturedItemDefinition.component.component.constituent.hasIngredient: The ingredient that is the constituent of the given component
title: ManufacturedItemDefinition.component.constituent.hasIngredient: The ingredient that is the constituent of the given component

detailSequence
type: ObjectProperty
comment: ClaimResponse.addItem.detailSequence: The sequence number of the details within the claim item which this line is intended to replace.
comment: ClaimResponse.item.detail.detailSequence: A number to uniquely reference the claim detail entry.
comment: ExplanationOfBenefit.addItem.detailSequence: The sequence number of the details within the claim item which this line is intended to replace.
comment: ClaimResponse.error.detailSequence: The sequence number of the detail within the line item submitted which contains the error. This value is omitted when the error occurs outside of the item structure.
modifierExtensionProperty: detailSequence
title: ClaimResponse.item.detail.detailSequence: Claim detail instance identifier
title: ClaimResponse.addItem.detailSequence: Detail sequence number
title: ClaimResponse.error.detailSequence: Detail sequence number
title: ExplanationOfBenefit.addItem.detailSequence: Detail sequence number

NutritionProductNutrientComponent
type: Class
comment: NutritionProductNutrientComponent: The product's nutritional information expressed by the nutrients.
subclass of: BackboneElement
subclass of: Restriction
  all values from: Ratio
  on property: amount
subclass of: Restriction
  max cardinality: 1
  on property: item
subclass of: Restriction
  all values from: CodeableReference
  on property: item

_fractionDescription
type: ObjectProperty
comment: (Modified) SubstanceSourceMaterial.fractionDescription

_degreeOfPolymerisation
type: ObjectProperty
comment: (Modified) SubstancePolymer.repeat.repeatUnit.degreeOfPolymerisation

_Account
type: Class
comment: (Modified) Account
subclass of: DomainResource

rangeCategory
type: ObjectProperty
comment: ObservationDefinition.component.qualifiedValue.rangeCategory: The category of range of values for continuous or ordinal observations that match the criteria of this set of qualified values.
comment: ObservationDefinition.qualifiedValue.rangeCategory: The category of range of values for continuous or ordinal observations that match the criteria of this set of qualified values.
modifierExtensionProperty: rangeCategory
title: ObservationDefinition.component.qualifiedValue.rangeCategory: reference | critical | absolute
title: ObservationDefinition.qualifiedValue.rangeCategory: reference | critical | absolute

_index
type: ObjectProperty
comment: (Modified) TestScript.destination.index
comment: (Modified) TestScript.origin.index

Restriction
max cardinality: 1
on property: occurrence

Restriction
max cardinality: 1
on property: occurrence

Restriction
max cardinality: 1
on property: occurrence

Restriction
max cardinality: 1
on property: occurrence

Restriction
max cardinality: 1
on property: type

Restriction
max cardinality: 1
on property: initiatorActive

Restriction
cardinality: 1
on property: title

Restriction
max cardinality: 1
on property: receiverActive

Restriction
max cardinality: 1
on property: receiver

Restriction
max cardinality: 1
on property: initiator

Restriction
max cardinality: 1
on property: receiver

Restriction
cardinality: 1
on property: title

Restriction
max cardinality: 1
on property: request

Restriction
max cardinality: 1
on property: description

Restriction
max cardinality: 1
on property: type

Restriction
max cardinality: 1
on property: receiverActive

Restriction
max cardinality: 1
on property: initiator

Restriction
max cardinality: 1
on property: initiator

Restriction
max cardinality: 1
on property: maxValue

Restriction
max cardinality: 1
on property: maxValue

Restriction
max cardinality: 1
on property: maxValue

Restriction
max cardinality: 1
on property: maxValue

Restriction
max cardinality: 1
on property: label

Restriction
max cardinality: 1
on property: maxLength

Restriction
max cardinality: 1
on property: min

Restriction
max cardinality: 1
on property: orderMeaning

Restriction
max cardinality: 1
on property: isModifier

Restriction
max cardinality: 1
on property: mustHaveValue

Restriction
max cardinality: 1
on property: sliceName

Restriction
cardinality: 1
on property: value

Restriction
cardinality: 1
on property: value

Restriction
cardinality: 1
on property: value

Restriction
cardinality: 1
on property: value

Restriction
cardinality: 1
on property: value

Restriction
max cardinality: 1
on property: copyright

Restriction
cardinality: 1
on property: status

union of: Restriction
  all values from: boolean
  on property: asNeeded
union of: Restriction
  max cardinality: 1
  on property: asNeeded
union of: Restriction
  all values from: CodeableConcept
  on property: asNeeded
union of: Restriction
  max cardinality: 1
  on property: asNeeded

Restriction
max cardinality: 1
on property: subtitle

Restriction
max cardinality: 1
on property: doNotPerform

Restriction
max cardinality: 1
on property: kind

Restriction
max cardinality: 1
on property: profile

Restriction
max cardinality: 1
on property: name

Restriction
max cardinality: 1
on property: publisher

Restriction
max cardinality: 1
on property: intent

Restriction
max cardinality: 1
on property: url

Restriction
max cardinality: 1
on property: transform