Failure link
From internal Test_openjdk17_j9_extended.functional_ppc64_aix_testList_0 (paix906)
java version "17.0.21-beta" 2026-10-20
IBM Semeru Runtime Certified Edition 17.0.21+7-202609261829 (build 17.0.21-beta+7-202609261829)
Eclipse OpenJ9 VM 17.0.21+7-202609261829 (build 17.0.21-beta+7-202609261829-master-f548046270, JRE 17 AIX ppc64-64-Bit Compressed References 20260926_1331 (JIT enabled, AOT enabled)
OpenJ9 - f548046270
OMR - 74fedf67a
JCL - 36afdf2ae1 based on jdk-17.0.21+7)
Rerun in Grinder - Change TARGET to run only the failed test targets
Optional info
Failure output (captured from console output)
[2026-09-26T20:18:00.935Z] Running test openJcePlusTests_0 ...
[2026-09-26T20:18:00.935Z] ===============================================
[2026-09-26T20:18:00.935Z] openJcePlusTests_0 Start Time: Sat Sep 26 16:18:00 2026 Epoch Time (ms): 1790453880735
[2026-09-26T20:18:00.935Z] variation: NoOptions
[2026-09-26T20:18:00.935Z] JVM_OPTIONS:
[2026-09-26T22:17:29.190Z] [ERROR] ibm.jceplus.junit.tests.TestProviderServices.testDefaultSecureRandom
[2026-09-26T22:17:29.190Z] [ERROR] Run 1: TestProviderServices.testDefaultSecureRandom:256 SecureRandom not SunJCE - SHA256DRBG ==> expected: <true> but was: <false>
[2026-09-26T22:17:29.190Z] [ERROR] Run 2: TestProviderServices.testDefaultSecureRandom:256 SecureRandom not SunJCE - SHA256DRBG ==> expected: <true> but was: <false>
[2026-09-26T22:17:29.190Z] [INFO]
[2026-09-26T22:17:29.190Z] [ERROR] ibm.jceplus.junit.tests.TestProviderServices.testDefaultSecureRandomFIPS
[2026-09-26T22:17:29.190Z] [ERROR] Run 1: TestProviderServices.testDefaultSecureRandomFIPS:314 SecureRandom not SunJCE ==> expected: <true> but was: <false>
[2026-09-26T22:17:29.190Z] [ERROR] Run 2: TestProviderServices.testDefaultSecureRandomFIPS:300 Assumption failed: Aborting test: Not in FIPS provider.
50x internal Grinder - seems consistent failure
FYI @jasonkatonica
Failure link
From internal Test_openjdk17_j9_extended.functional_ppc64_aix_testList_0 (paix906)
Rerun in Grinder - Change TARGET to run only the failed test targets
Optional info
Failure output (captured from console output)
50x internal Grinder - seems consistent failure
FYI @jasonkatonica